program: Orca
programVersion: 5.0.2
elementType: F F F O O O N N C C C C C C C C C C C C C C C C H H H H H H H H H H H H H H H H H H H H H
charge: 0
multiplicity: 1
keywords: wb97x-d3
keywords: def2-TZVPP
keywords: def2/J RIJCOSX
keywords: DEFGRID2
keywords: scfconv7
keywords: smallprint printgap noloewdin
keywords: NOSOSCF
formula: C16H21F3N2O3
InChI: InChI=1/C16H21F3N2O3/c1-10(2)13(21-15(23)24-9-16(17,18)19)8-20-14(22)12-6-4-11(3)5-7-12/h4-7,10,13,20-21H,8-9H2,1-3H3
45 atoms
F  -0.383512 -3.969485 0.420345
F  -2.518361 -3.760776 0.167502
F  -1.202036 -3.610872 -1.536492
O  0.007348 -1.344727 -0.440135
O  0.659456 -0.934975 1.684817
O  0.912625 2.027178 -1.584319
N  2.035073 -0.536721 -0.091577
N  1.265447 2.032377 0.650464
C  3.000598 0.253202 0.639934
C  4.43455 -0.087851 0.207971
C  2.676455 1.761433 0.540067
C  5.453698 0.689634 1.036529
C  4.692876 0.107113 -1.283788
C  0.888357 -0.936123 0.500734
C  0.469866 2.059236 -0.452449
C  -0.999761 2.11175 -0.193657
C  -1.557534 2.622768 0.974001
C  -1.851178 1.63708 -1.186674
C  -3.787325 2.149627 0.168483
C  -1.245363 -1.811654 -0.006617
C  -2.931254 2.643212 1.148005
C  -3.222406 1.647948 -1.001381
C  -5.272715 2.148165 0.373766
C  -1.32895 -3.304195 -0.243351
H  2.901012 -0.042618 1.686323
H  4.565337 -1.151457 0.430241
H  3.200991 2.29842 1.331919
H  3.017518 2.175062 -0.407726
H  6.461137 0.316216 0.851717
H  5.457556 1.752891 0.789463
H  5.262702 0.59548 2.107174
H  4.558707 1.143053 -1.59873
H  5.71932 -0.170533 -1.525688
H  4.048655 -0.516319 -1.904728
H  2.00425 -0.41805 -1.092956
H  0.833593 1.813464 1.533165
H  -0.929778 3.045383 1.748888
H  -1.428501 1.262241 -2.10919
H  -2.016203 -1.30626 -0.591631
H  -1.417604 -1.599678 1.049552
H  -3.344652 3.060584 2.058158
H  -3.867615 1.271872 -1.786531
H  -5.59889 3.012979 0.950743
H  -5.809218 2.158609 -0.574142
H  -5.591555 1.257081 0.918243
totalener: -1257.29025235 hartree
nucrepener: 2251.36740273 hartree
electener: -3508.65765508 hartree
oneelecener: -6197.79071424 hartree
twoeener: 2689.13305916 hartree
kineticenergy: 1252.25970276 hartree
xcener: -115.103113087828 hartree
chargesum: -0.0000000
charge: -0.165155 -0.175714 -0.170549 -0.300068 -0.412371 -0.410679 -0.234449 -0.193978 0.139275 0.014794 -0.145691 -0.290992 -0.282736 0.414539 0.373561 0.013206 -0.161816 -0.238679 0.015254 -0.022940 -0.132940 -0.119454 -0.203832 0.488674 0.103453 0.048068 0.105997 0.122730 0.092327 0.080509 0.092940 0.089048 0.087723 0.083563 0.158698 0.147464 0.118013 0.138992 0.104866 0.117593 0.111919 0.120368 0.089094 0.087006 0.102375
qa: -0.1652 -0.1757 -0.1705 -0.3001 -0.4124 -0.4107 -0.2344 -0.1940 0.1393 0.0148 -0.1457 -0.2910 -0.2827 0.4145 0.3736 0.0132 -0.1618 -0.2387 0.0153 -0.0229 -0.1329 -0.1195 -0.2038 0.4887 0.1035 0.0481 0.1060 0.1227 0.0923 0.0805 0.0929 0.0890 0.0877 0.0836 0.1587 0.1475 0.1180 0.1390 0.1049 0.1176 0.1119 0.1204 0.0891 0.0870 0.1024
va: 1.1419 1.1310 1.1348 2.0754 2.0965 2.0997 3.1916 3.1614 3.8119 3.9206 3.9249 3.9396 3.9467 4.4161 4.1306 3.5873 4.0434 4.0135 3.7884 3.8831 4.0000 3.8875 3.9096 4.4614 1.0291 1.0195 1.0085 1.0131 1.0089 1.0004 1.0046 1.0046 1.0047 1.0127 1.0426 1.0359 1.0210 1.0297 1.0179 1.0332 1.0090 1.0058 1.0032 1.0055 0.9933
dispcorr: -0.023937193 hartree
energy: -1257.314189544483
dipole: 20.52402 -20.55461 -0.03059 29.92246 -28.96795 0.95451 4.35827 -3.71406 0.64421
magnitude: 1.15197 au
magnitude: 2.92807 debye
