program: Orca
programVersion: 5.0.2
elementType: F F F O O O N N C C C C C C C C C C C C C C C C H H H H H H H H H H H H H H H H H H H H H
charge: 0
multiplicity: 1
keywords: wb97x-d3
keywords: def2-TZVPP
keywords: def2/J RIJCOSX
keywords: DEFGRID2
keywords: scfconv7
keywords: smallprint printgap noloewdin
keywords: NOSOSCF
formula: C16H21F3N2O3
InChI: InChI=1/C16H21F3N2O3/c1-10(2)13(21-15(23)24-9-16(17,18)19)8-20-14(22)12-6-4-11(3)5-7-12/h4-7,10,13,20-21H,8-9H2,1-3H3
45 atoms
F  -2.16494 -1.690774 -1.268434
F  -1.132034 -3.566621 -1.477236
F  -2.670993 -3.348034 0.019909
O  0.403254 -1.644884 -0.230877
O  1.276885 -1.057693 1.755675
O  0.668035 1.892834 -1.601647
N  2.293771 -0.489867 -0.208004
N  1.309667 1.985427 0.558365
C  3.245122 0.433968 0.367747
C  4.620706 0.280989 -0.291914
C  2.715902 1.883731 0.277184
C  5.149353 -1.141251 -0.139683
C  5.623716 1.279441 0.281774
C  1.327038 -1.052128 0.548155
C  0.376003 1.886182 -0.42053
C  -1.044741 1.776033 0.026744
C  -2.0390 2.155123 -0.871785
C  -1.42491 1.260685 1.261698
C  -3.762219 1.535765 0.706307
C  -0.655566 -2.275525 0.449496
C  -3.372786 2.046582 -0.530715
C  -2.767129 1.139543 1.59132
C  -5.214883 1.416945 1.058105
C  -1.657679 -2.717865 -0.592068
H  3.341986 0.16216 1.421894
H  4.505743 0.496764 -1.36242
H  3.258885 2.518735 0.978008
H  2.890843 2.284496 -0.722236
H  4.476288 -1.877741 -0.575389
H  6.11846 -1.246038 -0.628795
H  5.282116 -1.39697 0.91377
H  5.354065 2.315872 0.079509
H  5.71941 1.162194 1.363959
H  6.611544 1.117754 -0.149968
H  2.11333 -0.410222 -1.198293
H  1.018734 1.979874 1.519665
H  -1.754839 2.533722 -1.844099
H  -0.688891 0.901098 1.971018
H  -1.153688 -1.596756 1.145837
H  -0.31137 -3.147663 1.012156
H  -4.129489 2.355173 -1.242178
H  -3.040674 0.723209 2.55334
H  -5.691714 2.3975 1.098831
H  -5.754139 0.827128 0.315935
H  -5.358213 0.940507 2.026703
totalener: -1257.29169612 hartree
nucrepener: 2273.26905856 hartree
electener: -3530.56075468 hartree
oneelecener: -6241.84340008 hartree
twoeener: 2711.28264540 hartree
kineticenergy: 1252.25445563 hartree
xcener: -115.102098680776 hartree
chargesum: 0.0000000
charge: -0.157705 -0.167900 -0.177415 -0.286350 -0.418989 -0.417691 -0.218573 -0.185028 0.100663 0.003899 -0.102440 -0.256149 -0.283884 0.420611 0.342789 0.042102 -0.132894 -0.259526 0.028082 -0.045921 -0.134606 -0.157539 -0.206245 0.486214 0.090348 0.042598 0.104037 0.111207 0.091058 0.086952 0.079615 0.087851 0.085083 0.088408 0.156119 0.149731 0.129324 0.130475 0.108637 0.133358 0.114655 0.115381 0.099394 0.100831 0.079432
qa: -0.1577 -0.1679 -0.1774 -0.2864 -0.4190 -0.4177 -0.2186 -0.1850 0.1007 0.0039 -0.1024 -0.2561 -0.2839 0.4206 0.3428 0.0421 -0.1329 -0.2595 0.0281 -0.0459 -0.1346 -0.1575 -0.2062 0.4862 0.0903 0.0426 0.1040 0.1112 0.0911 0.0870 0.0796 0.0879 0.0851 0.0884 0.1561 0.1497 0.1293 0.1305 0.1086 0.1334 0.1147 0.1154 0.0994 0.1008 0.0794
va: 1.1449 1.1397 1.1271 2.0828 2.0887 2.0896 3.1663 3.1741 3.7856 3.9218 3.8747 3.9272 3.9464 4.3944 4.2067 3.5413 4.0743 3.9789 3.7886 3.9099 3.9596 3.9951 3.9085 4.4575 1.0397 1.0176 1.0055 1.0270 1.0183 1.0077 1.0051 1.0057 1.0033 1.0090 1.0399 1.0270 1.0280 1.0325 1.0109 1.0156 1.0068 1.0098 0.9956 0.9974 1.0093
dispcorr: -0.024270018 hartree
energy: -1257.315966132961
dipole: 26.43864 -26.06539 0.37326 21.34814 -20.80163 0.54651 10.40515 -9.48266 0.92249
magnitude: 1.13534 au
magnitude: 2.88579 debye
