program: Orca
programVersion: 5.0.2
elementType: F F F O O O N N C C C C C C C C C C C C C C C C H H H H H H H H H H H H H H H H H H H H H
charge: 0
multiplicity: 1
keywords: wb97x-d3
keywords: def2-TZVPP
keywords: def2/J RIJCOSX
keywords: DEFGRID2
keywords: scfconv7
keywords: smallprint printgap noloewdin
keywords: NOSOSCF
formula: C16H21F3N2O3
InChI: InChI=1/C16H21F3N2O3/c1-10(2)13(21-15(23)24-9-16(17,18)19)8-20-14(22)12-6-4-11(3)5-7-12/h4-7,10,13,20-21H,8-9H2,1-3H3
45 atoms
F  -1.148701 -3.557384 -1.368577
F  -2.681247 -3.321987 0.132102
F  -2.179041 -1.678087 -1.174291
O  0.398827 -1.633432 -0.149407
O  1.25318 -0.971016 1.822265
O  0.70221 1.877832 -1.644297
N  2.284137 -0.470464 -0.151949
N  1.309028 2.032964 0.521521
C  3.237891 0.465684 0.398939
C  4.614572 0.283609 -0.2512
C  2.718417 1.916171 0.262545
C  5.131251 -1.138125 -0.058027
C  5.623378 1.289374 0.298608
C  1.313371 -1.008815 0.615825
C  0.390823 1.900193 -0.468234
C  -1.03624 1.784145 -0.043196
C  -2.018601 2.1047 -0.975535
C  -1.432727 1.31306 1.205294
C  -3.762624 1.503159 0.586459
C  -0.662797 -2.246255 0.542724
C  -3.357915 1.977336 -0.658916
C  -2.777505 1.173506 1.510913
C  -5.215962 1.316381 0.903784
C  -1.669543 -2.698943 -0.490026
H  3.329283 0.225664 1.461218
H  4.504866 0.47106 -1.327556
H  3.25624 2.566298 0.953337
H  2.909178 2.288862 -0.744688
H  5.25396 -1.366995 1.002811
H  4.455751 -1.880795 -0.479239
H  6.103162 -1.263443 -0.536624
H  5.360833 2.322112 0.069878
H  5.716798 1.198758 1.383514
H  6.610608 1.110199 -0.127585
H  2.114225 -0.428576 -1.146328
H  1.005115 2.045617 1.478684
H  -1.722301 2.453933 -1.955203
H  -0.705567 1.004661 1.946945
H  -1.155572 -1.553927 1.229363
H  -0.322377 -3.111441 1.118287
H  -4.105024 2.242316 -1.397382
H  -3.06238 0.795065 2.48537
H  -5.404825 1.362057 1.975618
H  -5.832267 2.07571 0.423324
H  -5.567064 0.344356 0.551816
totalener: -1257.29160260 hartree
nucrepener: 2277.90483045 hartree
electener: -3535.19643305 hartree
oneelecener: -6251.10920295 hartree
twoeener: 2715.91276991 hartree
kineticenergy: 1252.25404578 hartree
xcener: -115.102223556825 hartree
chargesum: -0.0000000
charge: -0.167666 -0.178114 -0.157439 -0.287136 -0.419017 -0.418206 -0.217113 -0.186066 0.100351 0.003129 -0.102838 -0.255938 -0.283477 0.420137 0.341589 0.037151 -0.134368 -0.250066 0.029247 -0.047886 -0.124669 -0.165330 -0.204260 0.487312 0.090641 0.042972 0.104221 0.111643 0.079750 0.090785 0.086912 0.087820 0.085085 0.088490 0.156215 0.149721 0.128997 0.127904 0.108999 0.133847 0.111869 0.116456 0.084562 0.088662 0.105122
qa: -0.1677 -0.1781 -0.1574 -0.2871 -0.4190 -0.4182 -0.2171 -0.1861 0.1004 0.0031 -0.1028 -0.2559 -0.2835 0.4201 0.3416 0.0372 -0.1344 -0.2501 0.0292 -0.0479 -0.1247 -0.1653 -0.2043 0.4873 0.0906 0.0430 0.1042 0.1116 0.0798 0.0908 0.0869 0.0878 0.0851 0.0885 0.1562 0.1497 0.1290 0.1279 0.1090 0.1338 0.1119 0.1165 0.0846 0.0887 0.1051
va: 1.1402 1.1262 1.1442 2.0821 2.0887 2.0893 3.1653 3.1775 3.7828 3.9231 3.8762 3.9273 3.9465 4.3951 4.2113 3.5462 4.0823 3.9727 3.7824 3.9117 3.9601 3.9971 3.9059 4.4533 1.0395 1.0175 1.0053 1.0269 1.0051 1.0183 1.0078 1.0058 1.0033 1.0090 1.0399 1.0274 1.0283 1.0326 1.0117 1.0153 1.0077 1.0087 1.0056 1.0035 0.9933
dispcorr: -0.024438564 hartree
energy: -1257.316041162347
dipole: 26.47239 -26.10307 0.36931 21.00978 -20.51683 0.49295 9.65003 -8.75342 0.89661
magnitude: 1.08780 au
magnitude: 2.76496 debye
