program: Orca
programVersion: 5.0.2
elementType: F F F O O O N N C C C C C C C C C C C C C C C C H H H H H H H H H H H H H H H H H H H H H
charge: 0
multiplicity: 1
keywords: wb97x-d3
keywords: def2-TZVPP
keywords: def2/J RIJCOSX
keywords: DEFGRID2
keywords: scfconv7
keywords: smallprint printgap noloewdin
keywords: NOSOSCF
formula: C16H21F3N2O3
InChI: InChI=1/C16H21F3N2O3/c1-10(2)13(21-15(23)24-9-16(17,18)19)8-20-14(22)12-6-4-11(3)5-7-12/h4-7,10,13,20-21H,8-9H2,1-3H3
45 atoms
F  -2.797888 -3.225515 0.22147
F  -1.93164 -2.240135 -1.487539
F  -0.961161 -3.961961 -0.64097
O  0.309131 -1.593533 -0.048692
O  1.005777 -0.551872 1.819683
O  0.646963 1.575005 -1.951815
N  2.226669 -0.495182 -0.111252
N  1.322726 2.138868 0.134421
C  3.181434 0.50474 0.312931
C  4.581583 0.157675 -0.210858
C  2.721524 1.912844 -0.121112
C  5.048758 -1.189137 0.330696
C  5.598309 1.244053 0.132262
C  1.172654 -0.840737 0.659514
C  0.376099 1.856613 -0.801164
C  -1.033292 1.884726 -0.310042
C  -1.967962 1.09157 -0.969198
C  -1.449852 2.644143 0.777792
C  -3.6975 1.77866 0.575672
C  -0.877342 -1.96269 0.614168
C  -3.275392 1.029675 -0.521214
C  -2.765149 2.592687 1.20982
C  -5.124147 1.72947 1.035431
C  -1.640616 -2.854524 -0.339428
H  3.207875 0.469485 1.405623
H  4.521465 0.089933 -1.305295
H  3.302716 2.669134 0.408366
H  2.898576 2.058255 -1.187347
H  6.022457 -1.454224 -0.082643
H  5.151083 -1.155855 1.417721
H  4.354571 -1.992393 0.088789
H  6.598103 0.939674 -0.178104
H  5.387575 2.192573 -0.361294
H  5.634688 1.425965 1.209097
H  2.131359 -0.645363 -1.104684
H  1.037705 2.112911 1.099642
H  -1.657688 0.513003 -1.828111
H  -0.760339 3.306017 1.287157
H  -1.488347 -1.089892 0.861496
H  -0.678302 -2.511658 1.538119
H  -3.982184 0.388796 -1.035074
H  -3.070388 3.197663 2.054737
H  -5.516111 0.712663 1.017744
H  -5.234876 2.111365 2.049288
H  -5.763262 2.332568 0.387916
totalener: -1257.29159451 hartree
nucrepener: 2271.88071310 hartree
electener: -3529.17230760 hartree
oneelecener: -6238.86815578 hartree
twoeener: 2709.69584818 hartree
kineticenergy: 1252.25709736 hartree
xcener: -115.101147522693 hartree
chargesum: 0.0000000
charge: -0.176556 -0.168642 -0.166978 -0.289669 -0.411467 -0.407471 -0.222542 -0.199140 0.088920 0.005861 -0.103352 -0.256933 -0.285413 0.416586 0.369948 -0.003074 -0.217908 -0.156697 0.021218 -0.057923 -0.134542 -0.130415 -0.204017 0.495395 0.092619 0.040740 0.102999 0.111411 0.087137 0.078960 0.092627 0.088095 0.089078 0.085602 0.154904 0.148733 0.139157 0.118852 0.116392 0.138011 0.121108 0.110297 0.092910 0.082634 0.102544
qa: -0.1766 -0.1686 -0.1670 -0.2897 -0.4115 -0.4075 -0.2225 -0.1991 0.0889 0.0059 -0.1034 -0.2569 -0.2854 0.4166 0.3699 -0.0031 -0.2179 -0.1567 0.0212 -0.0579 -0.1345 -0.1304 -0.2040 0.4954 0.0926 0.0407 0.1030 0.1114 0.0871 0.0790 0.0926 0.0881 0.0891 0.0856 0.1549 0.1487 0.1392 0.1189 0.1164 0.1380 0.1211 0.1103 0.0929 0.0826 0.1025
va: 1.1292 1.1292 1.1414 2.0688 2.0975 2.1044 3.1694 3.1528 3.8313 3.9221 3.9048 3.9245 3.9475 4.3940 4.1422 3.6033 3.9870 4.0407 3.7699 3.9218 3.9055 3.9954 3.9109 4.4400 1.0328 1.0176 1.0067 1.0265 1.0076 1.0049 1.0184 1.0088 1.0043 1.0032 1.0408 1.0336 1.0379 1.0208 1.0013 1.0184 1.0097 1.0097 1.0011 1.0073 0.9933
dispcorr: -0.024556106 hartree
energy: -1257.316150612664
dipole: 25.78388 -25.38324 0.40064 23.94368 -23.24261 0.70107 9.14960 -8.22406 0.92554
magnitude: 1.22827 au
magnitude: 3.12201 debye
