program: Orca
programVersion: 5.0.2
elementType: F F F O O O N N C C C C C C C C C C C C C C C C H H H H H H H H H H H H H H H H H H H H H
charge: 0
multiplicity: 1
keywords: wb97x-d3
keywords: def2-TZVPP
keywords: def2/J RIJCOSX
keywords: DEFGRID2
keywords: scfconv7
keywords: smallprint printgap noloewdin
keywords: NOSOSCF
formula: C16H21F3N2O3
InChI: InChI=1/C16H21F3N2O3/c1-10(2)13(21-15(23)24-9-16(17,18)19)8-20-14(22)12-6-4-11(3)5-7-12/h4-7,10,13,20-21H,8-9H2,1-3H3
45 atoms
F  -2.235723 -3.743056 0.814541
F  -0.769832 -3.95669 -0.755546
F  -0.129601 -3.547808 1.254212
O  0.03755 -1.289445 -0.395319
O  0.614568 -0.577124 1.671709
O  0.811252 2.100261 -1.77207
N  2.016922 -0.350224 -0.113916
N  1.211351 2.273058 0.449198
C  2.966762 0.518915 0.541143
C  4.405854 0.198643 0.113161
C  2.621262 2.007886 0.326421
C  4.59927 0.19994 -1.402504
C  4.870307 -1.125725 0.708728
C  0.874497 -0.721119 0.503163
C  0.392491 2.195518 -0.634666
C  -1.0722 2.212578 -0.342784
C  -1.927831 1.639327 -1.2809
C  -1.622138 2.77392 0.803457
C  -3.849373 2.158177 0.092896
C  -1.186293 -1.78547 0.084217
C  -3.291549 1.60561 -1.059243
C  -2.99228 2.747333 1.014455
C  -5.331308 2.116798 0.319658
C  -1.070519 -3.273372 0.352424
H  2.883813 0.309789 1.609861
H  5.030739 0.996656 0.531341
H  3.166655 2.604188 1.061184
H  2.937724 2.348086 -0.657983
H  4.122809 -0.665453 -1.867767
H  4.20702 1.095929 -1.88479
H  5.659272 0.139901 -1.648783
H  5.901677 -1.341927 0.428239
H  4.819578 -1.115776 1.798227
H  4.250394 -1.951296 0.356659
H  2.005583 -0.351738 -1.122551
H  0.8019 2.091821 1.35112
H  -1.511744 1.221794 -2.187874
H  -0.994746 3.26794 1.535058
H  -1.931828 -1.616535 -0.694038
H  -1.511255 -1.273378 0.991525
H  -3.939197 1.151597 -1.800239
H  -3.399601 3.200538 1.909799
H  -5.685629 1.090305 0.426861
H  -5.616791 2.658149 1.220262
H  -5.873053 2.557969 -0.517771
totalener: -1257.29104393 hartree
nucrepener: 2261.32357957 hartree
electener: -3518.61462350 hartree
oneelecener: -6217.81958190 hartree
twoeener: 2699.20495840 hartree
kineticenergy: 1252.26019430 hartree
xcener: -115.102039444159 hartree
chargesum: 0.0000000
charge: -0.175497 -0.171679 -0.161694 -0.303473 -0.409925 -0.409744 -0.242471 -0.192606 0.138137 0.015251 -0.132678 -0.301981 -0.272638 0.422138 0.372501 0.003588 -0.206955 -0.155881 0.007122 -0.034846 -0.129236 -0.126265 -0.205152 0.490674 0.099861 0.037325 0.100073 0.115170 0.073221 0.106907 0.092562 0.087104 0.082645 0.088828 0.160842 0.148157 0.134542 0.116572 0.113246 0.116697 0.120421 0.110131 0.099658 0.080566 0.098777
qa: -0.1755 -0.1717 -0.1617 -0.3035 -0.4099 -0.4097 -0.2425 -0.1926 0.1381 0.0153 -0.1327 -0.3020 -0.2726 0.4221 0.3725 0.0036 -0.2070 -0.1559 0.0071 -0.0348 -0.1292 -0.1263 -0.2052 0.4907 0.0999 0.0373 0.1001 0.1152 0.0732 0.1069 0.0926 0.0871 0.0826 0.0888 0.1608 0.1482 0.1345 0.1166 0.1132 0.1167 0.1204 0.1101 0.0997 0.0806 0.0988
va: 1.1318 1.1325 1.1450 2.0705 2.0974 2.1030 3.1943 3.1486 3.8011 3.9060 3.9502 3.9412 3.9351 4.3943 4.1381 3.6018 4.0082 4.0428 3.8003 3.9150 3.9049 3.9904 3.9107 4.4615 1.0243 1.0125 1.0115 1.0186 1.0062 1.0090 1.0074 1.0057 1.0079 1.0123 1.0387 1.0358 1.0302 1.0214 1.0107 1.0264 1.0052 1.0101 0.9954 1.0095 0.9971
dispcorr: -0.024054197 hartree
energy: -1257.315098127998
dipole: 17.06823 -17.16990 -0.10167 26.06837 -25.19458 0.87379 -1.62373 2.00835 0.38461
magnitude: 0.96009 au
magnitude: 2.44035 debye
