program: Gaussian 09
title: 000064479
version: EM64L-G09RevD.01
frameworkgroup: C1[X(C13H18N2)]
method: RPBEPBE
basis: SDD
operation: Freq
keyword: #pfreq=noraman
keyword: PBEPBE/SDD
title: #p freq=noraman PBEPBE/SDD
converged: NO YES NO NO
title: Mulliken charges:
elementType: N N C C C C C C C C C C C C C H H H H H H H H H H H H H H H H H H
charge: -0.390935 -0.071292 0.360203 -0.103186 -0.095299 -0.095308 -0.546539 -0.526716 -0.526710 -0.450704 -0.450696 -0.450495 0.087596 -0.234388 -0.328882 0.198446 0.197442 0.197443 0.225960 0.225944 0.177066 0.222796 0.222795 0.177045 0.195043 0.197345 0.197344 0.195042 0.200544 0.187634 0.298475 0.255864 0.251124
chargesum: 0.00000
title: Mulliken charges with hydrogens summed into heavy atoms:
elementType: N N C C C C C C C C C C C C C
charge: -0.092460 -0.071292 0.360203 0.095260 0.102143 0.102134 -0.094634 -0.126855 -0.126870 -0.058315 -0.058310 -0.062317 0.087596 0.021477 -0.077758
polarizability: 1.70688510e+02 7.82117377e-02 1.31897192e+02 -2.07603331e-03 -4.87200705e-03 1.09759511e+02
1716.lowfreq: -25.4614 -0.0006 -0.0005 0.0002 3.1336 12.5213 19.3068 96.7578 127.8578
frequency: 5.0319 96.7565 127.7469 268.6909 276.7483 284.7410 292.7844 371.5336 378.1485 397.0086 406.5836 428.4981 443.9672 451.3701 626.7226 635.4021 635.9887 647.6419 670.4720 715.7632 732.1735 759.2058 805.2917 810.7149 835.6828 844.0380 867.4819 869.3179 870.3445 899.8400 934.7623 938.3721 941.9151 967.5957 969.4421 980.4183 1041.3053 1041.6840 1048.6162 1049.0708 1075.2229 1100.1444 1100.5045 1102.2454 1104.5931 1105.6890 1111.2368 1156.8619 1179.6187 1181.5920 1235.9025 1254.3557 1261.6221 1284.7861 1288.1817 1289.4504 1304.7063 1310.4997 1314.0892 1323.1316 1338.3764 1340.6040 1341.4525 1353.5725 1354.9209 1357.9455 1365.9601 1448.2599 1448.3276 1458.7543 1459.7800 1462.1147 1466.4599 1480.7876 1518.5965 2948.1132 2953.9066 2957.7849 2962.3853 2962.5268 2988.0355 2990.2945 2996.3334 3007.7474 3014.6673 3016.2888 3021.2791 3024.7243 3027.2740 3055.1638 3223.6384 3253.7116 3587.7796
redmass: 4.2826 3.8589 3.6374 2.6019 2.6813 4.5210 1.9413 3.0685 3.4265 4.0617 2.1001 1.8750 2.7299 1.7516 3.1517 3.8800 3.7243 1.1851 4.1271 2.7272 1.7397 4.2629 2.7373 2.7659 3.8636 1.3688 1.5813 1.5858 1.5928 5.9905 2.7442 2.1064 2.6253 2.2164 2.2231 2.2680 3.5573 1.8776 1.7975 1.7158 1.6220 1.6562 1.2950 1.7180 1.5272 1.0515 1.0155 1.8973 1.1955 1.3218 2.0959 1.5351 1.8468 1.7788 1.8885 1.9028 2.0679 1.5505 1.7869 1.3134 1.6494 2.2486 1.4720 1.5912 1.6992 1.5765 2.2962 1.0851 1.0826 1.1749 1.0913 1.7704 1.6407 1.1061 3.5979 1.0628 1.0624 1.0627 1.0622 1.0608 1.0749 1.0841 1.0768 1.0782 1.1018 1.1005 1.1018 1.1005 1.1015 1.1021 1.0914 1.1087 1.0814
irintensity: 6.8847 1.3140 3.9130 1.5913 1.8526 1.2079 0.0033 1.6155 0.2369 0.8028 0.7920 0.6452 1.6864 0.5171 1.7190 0.1682 1.5518 85.4579 2.6656 23.6641 52.8583 1.1574 2.7781 2.4193 0.1546 10.6822 0.0240 0.0153 0.0264 2.3940 3.5294 0.3760 5.6092 3.7557 3.0967 11.9043 0.5613 0.3257 0.6842 0.1348 23.3217 14.6688 2.9503 13.3651 0.2059 1.4714 0.2020 0.4870 1.2172 1.1397 9.0872 0.1167 2.1101 0.0572 1.0967 0.0781 12.9194 0.4616 3.8344 0.0000 1.7595 4.8575 2.1115 11.4020 7.2362 0.1454 6.6207 1.9710 0.2020 13.7045 16.3957 3.3068 25.5752 0.5014 53.3234 10.5264 70.9377 26.2089 35.5585 19.7785 66.5307 134.5022 129.1495 31.0501 5.0724 7.1544 39.0736 67.2731 89.1092 34.4585 4.3698 6.9757 19.9395
temp: 298.150 k
press: 1.00000 atm
elementType: 7 7 6 6 6 6 6 6 6 6 6 6 6 6 6 1 1 1 1 1 1 1 1 1 1 1 1 1 1 1 1 1 1
symmnumber: 1
zpe: 757480.6 jmol-1
zpe.correction: 0.288509 hartree
zpe.thermalcorrener: 0.299933 hartree
zpe.thermalcorrenthalpy: 0.300877 hartree
zpe.thermalcorrgfe: 0.249540 hartree
zpe.sumelectzpe: -614.572027 hartree
zpe.sumelectthermal: -614.560603 hartree
zpe.sumelectthermalent: -614.559659 hartree
zpe.sumelectthermalfe: -614.610996 hartree
dipole: 0.8576 -3.4463 0.0004
dipole: 3.5514
quadrupole: -86.9256 -88.3468 -91.8299
quadrupole: 8.5995 -0.0014 -0.0011
quadrupole: 2.1085 0.6873 -2.7958 8.5995 -0.0014 -0.0011
hfenergy: -614.8605362 hartree
pointgroup: C01 [X(C13H18N2)]
dipole: 0.3454261 -1.353872 0.0001432 debye
polarizability: 170.6862173|0.3082736|131.8994847|-0.0020471|-0.0048842|109.7595111 unknown
InChI: InChI=1S/C13H18N2/c1-2-15-12(14-1)13-6-9-3-10(7-13)5-11(4-9)8-13/h1-2,9-11,14H,3-8H2
charge 0 multiplicity 1
33 atoms
N  -2.461511 -1.097211 0.000158
N  -2.455951 1.155015 -0.00004
C  -0.15682 0.019713 -0.000033
C  1.955609 1.446201 -0.000491
C  1.928363 -0.748734 1.268629
C  1.928347 -0.749523 -1.268254
C  0.405248 1.471814 -0.000475
C  0.376562 -0.724532 1.270692
C  0.376544 -0.725311 -1.270311
C  2.465373 0.708531 1.267353
C  2.465355 0.707744 -1.267877
C  2.433245 -1.488904 0.000412
C  -1.668042 0.055689 -0.000008
C  -3.807594 -0.707241 0.000318
C  -3.780751 0.688045 -0.000143
H  2.332473 2.487982 -0.00081
H  2.284016 -1.277246 2.175475
H  2.283986 -1.27859 -2.174781
H  0.021481 2.013419 0.884103
H  0.021457 2.012881 -0.885373
H  -0.011588 -1.764633 1.300092
H  0.001142 -0.211226 2.177732
H  0.00112 -0.212564 -2.177665
H  -0.011588 -1.765438 -1.299065
H  3.573898 0.703491 1.287196
H  2.122718 1.239343 2.178316
H  2.122701 1.237989 -2.179172
H  3.573881 0.702687 -1.287734
H  3.540892 -1.529515 0.000413
H  2.06888 -2.537104 0.000741
H  -2.121322 -2.05757 0.000237
H  -4.625087 -1.422951 0.000569
H  -4.62154 1.377747 -0.000304
