program: Orca
programVersion: 5.0.2
elementType: F F F O O O N N C C C C C C C C C C C C C C C C H H H H H H H H H H H H H H H H H H H H H
charge: 0
multiplicity: 1
keywords: wb97x-d3
keywords: def2-TZVPP
keywords: def2/J RIJCOSX
keywords: DEFGRID2
keywords: scfconv7
keywords: smallprint printgap noloewdin
keywords: NOSOSCF
formula: C16H21F3N2O3
InChI: InChI=1/C16H21F3N2O3/c1-10(2)13(21-15(23)24-9-16(17,18)19)8-20-14(22)12-6-4-11(3)5-7-12/h4-7,10,13,20-21H,8-9H2,1-3H3
45 atoms
F  -1.055403 -3.829205 -0.718909
F  -2.874414 -3.063772 0.154352
F  -1.981417 -2.068193 -1.535091
O  0.274007 -1.500035 -0.073866
O  0.976516 -0.526651 1.8280
O  0.722736 1.807691 -1.894883
N  2.206473 -0.419804 -0.093449
N  1.335239 2.200075 0.248892
C  3.175181 0.544734 0.37986
C  4.572963 0.204732 -0.154055
C  2.739097 1.981555 0.016267
C  5.004361 -1.189135 0.288598
C  5.606114 1.23941 0.285469
C  1.145502 -0.781786 0.659917
C  0.41717 1.971936 -0.729993
C  -1.002904 1.892195 -0.273582
C  -1.464081 2.443126 0.916963
C  -1.89833 1.186582 -1.073298
C  -3.670274 1.533677 0.535355
C  -0.925151 -1.856353 0.574551
C  -2.780818 2.268128 1.311613
C  -3.207308 1.002607 -0.667553
C  -5.087731 1.313533 0.972468
C  -1.707258 -2.710152 -0.398338
H  3.196344 0.454517 1.469467
H  4.526538 0.222253 -1.251024
H  3.311773 2.699666 0.604834
H  2.944289 2.187583 -1.034515
H  5.07015 -1.248326 1.377256
H  4.308583 -1.958802 -0.041577
H  5.987721 -1.434331 -0.113785
H  5.41552 2.22997 -0.126793
H  5.63631 1.328166 1.374028
H  6.602704 0.944166 -0.043154
H  2.120697 -0.537177 -1.092157
H  1.028346 2.091121 1.201523
H  -0.811342 3.036975 1.544736
H  -1.55407 0.770549 -2.009823
H  -1.516147 -0.974671 0.838887
H  -0.742475 -2.43028 1.486764
H  -3.119356 2.709601 2.240739
H  -3.882354 0.43296 -1.295098
H  -5.794106 1.720981 0.247962
H  -5.307627 0.249598 1.072251
H  -5.291052 1.783701 1.933407
totalener: -1257.29140346 hartree
nucrepener: 2287.28797503 hartree
electener: -3544.57937848 hartree
oneelecener: -6269.64262298 hartree
twoeener: 2725.06324450 hartree
kineticenergy: 1252.25317971 hartree
xcener: -115.101652188590 hartree
chargesum: -0.0000000
charge: -0.167183 -0.178011 -0.167824 -0.290358 -0.412901 -0.408388 -0.221619 -0.200970 0.087358 0.004522 -0.102739 -0.255392 -0.284638 0.414813 0.362683 -0.034486 -0.140727 -0.159480 0.015817 -0.057989 -0.116666 -0.169044 -0.202816 0.501467 0.093878 0.041885 0.103328 0.112232 0.079491 0.091312 0.087101 0.089564 0.085339 0.088056 0.154827 0.148133 0.111490 0.136177 0.113110 0.138778 0.110016 0.120689 0.100692 0.099006 0.079468
qa: -0.1672 -0.1780 -0.1678 -0.2904 -0.4129 -0.4084 -0.2216 -0.2010 0.0874 0.0045 -0.1027 -0.2554 -0.2846 0.4148 0.3627 -0.0345 -0.1407 -0.1595 0.0158 -0.0580 -0.1167 -0.1690 -0.2028 0.5015 0.0939 0.0419 0.1033 0.1122 0.0795 0.0913 0.0871 0.0896 0.0853 0.0881 0.1548 0.1481 0.1115 0.1362 0.1131 0.1388 0.1100 0.1207 0.1007 0.0990 0.0795
va: 1.1414 1.1282 1.1310 2.0701 2.0949 2.1055 3.1720 3.1601 3.8220 3.9246 3.9037 3.9254 3.9486 4.3973 4.1673 3.6320 4.0264 3.9597 3.7548 3.9209 3.9831 3.9002 3.9098 4.4388 1.0324 1.0172 1.0064 1.0278 1.0051 1.0184 1.0079 1.0046 1.0033 1.0088 1.0401 1.0367 1.0211 1.0358 1.0009 1.0198 1.0100 1.0110 0.9967 0.9970 1.0095
dispcorr: -0.025128747 hartree
energy: -1257.316532204062
dipole: 26.18040 -25.79961 0.38079 21.79117 -21.29015 0.50102 9.79765 -8.86092 0.93674
magnitude: 1.12849 au
magnitude: 2.86840 debye
