program: Orca
programVersion: 5.0.2
elementType: F F F O O O N N C C C C C C C C C C C C C C C C H H H H H H H H H H H H H H H H H H H H H
charge: 0
multiplicity: 1
keywords: wb97x-d3
keywords: def2-TZVPP
keywords: def2/J RIJCOSX
keywords: DEFGRID2
keywords: scfconv7
keywords: smallprint printgap noloewdin
keywords: NOSOSCF
formula: C16H21F3N2O3
InChI: InChI=1/C16H21F3N2O3/c1-10(2)13(21-15(23)24-9-16(17,18)19)8-20-14(22)12-6-4-11(3)5-7-12/h4-7,10,13,20-21H,8-9H2,1-3H3
45 atoms
F  0.436738 -3.765164 1.266359
F  -1.654644 -4.267956 1.051842
F  -0.348169 -4.27797 -0.665551
O  0.1253 -1.511454 -0.313094
O  0.639956 -0.62143 1.700452
O  0.594833 2.069366 -2.021632
N  1.975464 -0.321733 -0.12278
N  1.084068 2.337621 0.168546
C  2.860802 0.647749 0.478666
C  4.336253 0.311527 0.219958
C  2.491152 2.073201 0.036367
C  4.693499 0.22848 -1.261833
C  4.72639 -0.976658 0.936802
C  0.898648 -0.794953 0.534701
C  0.223595 2.22538 -0.874434
C  -1.22592 2.329979 -0.529523
C  -1.752179 1.875953 0.674928
C  -2.09331 2.855142 -1.483986
C  -3.981109 2.51647 -0.011528
C  -0.981269 -2.18345 0.230821
C  -3.114127 1.9660 0.924101
C  -3.445629 2.958427 -1.220796
C  -5.451545 2.63463 0.259241
C  -0.625927 -3.637656 0.472324
H  2.696136 0.579969 1.555944
H  4.915697 1.132637 0.658786
H  3.055934 2.791193 0.635651
H  2.762073 2.243873 -1.004504
H  4.442804 1.134266 -1.814327
H  5.765053 0.067916 -1.382484
H  4.195375 -0.611536 -1.750436
H  4.177501 -1.830231 0.537267
H  5.790579 -1.182874 0.817529
H  4.517228 -0.922338 2.005959
H  1.971628 -0.40224 -1.128155
H  0.713781 2.483954 1.091126
H  -1.119335 1.403597 1.416722
H  -1.696429 3.184971 -2.434606
H  -1.791303 -2.126912 -0.497617
H  -1.31939 -1.731692 1.164612
H  -3.506188 1.593371 1.862483
H  -4.102066 3.383342 -1.970875
H  -5.758138 3.680345 0.314782
H  -6.040174 2.169113 -0.532027
H  -5.728043 2.161098 1.199984
totalener: -1257.29227218 hartree
nucrepener: 2224.02563081 hartree
electener: -3481.31790299 hartree
oneelecener: -6143.28609428 hartree
twoeener: 2661.96819128 hartree
kineticenergy: 1252.26765326 hartree
xcener: -115.103693575429 hartree
chargesum: -0.0000000
charge: -0.164041 -0.174823 -0.170393 -0.301289 -0.420120 -0.413436 -0.238775 -0.180414 0.128692 0.027288 -0.115002 -0.296382 -0.271482 0.440687 0.330813 0.051144 -0.228484 -0.141575 0.020356 -0.025801 -0.156377 -0.145998 -0.205336 0.486989 0.096084 0.032480 0.099602 0.108545 0.097972 0.090529 0.075692 0.086403 0.089359 0.087198 0.158001 0.146836 0.133686 0.128906 0.122283 0.104051 0.112632 0.115284 0.100448 0.097261 0.080507
qa: -0.1640 -0.1748 -0.1704 -0.3013 -0.4201 -0.4134 -0.2388 -0.1804 0.1287 0.0273 -0.1150 -0.2964 -0.2715 0.4407 0.3308 0.0511 -0.2285 -0.1416 0.0204 -0.0258 -0.1564 -0.1460 -0.2053 0.4870 0.0961 0.0325 0.0996 0.1085 0.0980 0.0905 0.0757 0.0864 0.0894 0.0872 0.1580 0.1468 0.1337 0.1289 0.1223 0.1041 0.1126 0.1153 0.1004 0.0973 0.0805
va: 1.1410 1.1320 1.1346 2.0783 2.0838 2.0965 3.1859 3.1553 3.8081 3.8988 3.9107 3.9408 3.9379 4.3758 4.2035 3.5617 4.0079 4.0698 3.7891 3.9134 4.0299 3.9562 3.9093 4.4392 1.0361 1.0141 1.0116 1.0311 1.0069 1.0069 1.0082 1.0128 1.0061 1.0072 1.0383 1.0271 1.0354 1.0260 1.0053 1.0323 1.0107 1.0072 0.9950 0.9978 1.0090
dispcorr: -0.023004469 hartree
energy: -1257.315276649649
dipole: 13.60786 -13.72305 -0.11519 29.76396 -28.72499 1.03897 -1.58893 2.00381 0.41488
magnitude: 1.12466 au
magnitude: 2.85865 debye
