program: Orca
programVersion: 5.0.2
elementType: F F F O O O N N C C C C C C C C C C C C C C C C H H H H H H H H H H H H H H H H H H H H H
charge: 0
multiplicity: 1
keywords: wb97x-d3
keywords: def2-TZVPP
keywords: def2/J RIJCOSX
keywords: DEFGRID2
keywords: scfconv7
keywords: smallprint printgap noloewdin
keywords: NOSOSCF
formula: C16H21F3N2O3
InChI: InChI=1/C16H21F3N2O3/c1-10(2)13(21-15(23)24-9-16(17,18)19)8-20-14(22)12-6-4-11(3)5-7-12/h4-7,10,13,20-21H,8-9H2,1-3H3
45 atoms
F  -0.357973 -5.65858 -0.142844
F  -0.157863 -4.38471 -1.873413
F  1.42562 -4.469952 -0.422229
O  -0.070464 -2.118709 -0.214067
O  1.209903 -1.914326 1.642616
O  -0.152474 1.696195 -1.64749
N  1.324064 -0.412137 -0.059281
N  0.734766 2.409978 0.303963
C  2.274636 0.473158 0.580195
C  3.723528 -0.023599 0.417435
C  2.060602 1.893993 0.055712
C  4.693964 0.769714 1.28729
C  4.183935 -0.057628 -1.035236
C  0.867938 -1.513748 0.558514
C  -0.282031 2.272234 -0.581702
C  -1.58697 2.865203 -0.170989
C  -1.693079 3.948997 0.693045
C  -2.751157 2.317675 -0.704057
C  -4.103679 3.896508 0.530134
C  -0.561006 -3.35966 0.219434
C  -2.936861 4.456642 1.036253
C  -3.987707 2.820362 -0.348542
C  -5.453907 4.428417 0.907734
C  0.10009 -4.474058 -0.566536
H  2.054054 0.472522 1.653379
H  3.718767 -1.050472 0.793962
H  2.779839 2.562861 0.529719
H  2.245252 1.946227 -1.017491
H  4.354816 0.822957 2.323579
H  5.676057 0.296381 1.292994
H  4.837629 1.790642 0.927556
H  4.293745 0.943522 -1.457245
H  5.15653 -0.543932 -1.115186
H  3.492004 -0.615448 -1.666614
H  0.919606 -0.141016 -0.94439
H  0.514565 2.695747 1.242231
H  -0.806671 4.435376 1.082056
H  -2.677816 1.490613 -1.397178
H  -1.635275 -3.380862 0.027643
H  -0.392174 -3.519454 1.285948
H  -2.997549 5.308758 1.702024
H  -4.882656 2.372807 -0.764317
H  -6.035934 3.67738 1.444156
H  -5.377494 5.305005 1.549137
H  -6.029507 4.711888 0.025773
totalener: -1257.29311737 hartree
nucrepener: 2140.79786821 hartree
electener: -3398.09098557 hartree
oneelecener: -5976.90232408 hartree
twoeener: 2578.81133851 hartree
kineticenergy: 1252.25446897 hartree
xcener: -115.100973044643 hartree
chargesum: 0.0000000
charge: -0.175705 -0.170224 -0.166309 -0.308390 -0.423393 -0.443567 -0.257205 -0.196051 0.105457 0.055106 -0.136759 -0.295368 -0.300545 0.463849 0.429618 -0.017672 -0.188510 -0.141697 0.013237 -0.037550 -0.137655 -0.142060 -0.205537 0.481557 0.079440 0.056132 0.109763 0.123053 0.093984 0.093221 0.071618 0.070358 0.092236 0.100268 0.182021 0.135180 0.120518 0.133404 0.115442 0.113085 0.110556 0.115791 0.100300 0.079757 0.099249
qa: -0.1757 -0.1702 -0.1663 -0.3084 -0.4234 -0.4436 -0.2572 -0.1961 0.1055 0.0551 -0.1368 -0.2954 -0.3005 0.4638 0.4296 -0.0177 -0.1885 -0.1417 0.0132 -0.0375 -0.1377 -0.1421 -0.2055 0.4816 0.0794 0.0561 0.1098 0.1231 0.0940 0.0932 0.0716 0.0704 0.0922 0.1003 0.1820 0.1352 0.1205 0.1334 0.1154 0.1131 0.1106 0.1158 0.1003 0.0798 0.0992
va: 1.1300 1.1344 1.1378 2.0784 2.0952 2.0551 3.1801 3.1883 3.9029 3.8091 3.8849 3.9512 3.9471 4.3423 4.0668 3.6806 4.0303 4.0571 3.8073 3.9260 3.9978 3.9626 3.9117 4.4211 1.0354 1.0272 1.0079 1.0112 1.0043 1.0070 1.0019 1.0006 1.0056 1.0138 1.0485 1.0348 1.0225 1.0254 1.0058 1.0327 1.0111 1.0073 0.9956 1.0092 0.9972
dispcorr: -0.020412083 hartree
energy: -1257.313529449307
dipole: 7.54145 -8.15675 -0.61530 41.49520 -39.62591 1.86929 9.51865 -8.57709 0.94156
magnitude: 2.18160 au
magnitude: 5.54518 debye
