program: Orca
programVersion: 5.0.2
elementType: Cl Cl O O N N C C C C C C C C C C C C C C C H H H H H H H H H H H H H H H H H H
charge: 0
multiplicity: 1
keywords: wb97x-d3
keywords: def2-TZVPP
keywords: def2/J RIJCOSX
keywords: DEFGRID2
keywords: scfconv7
keywords: smallprint printgap noloewdin
keywords: NOSOSCF
formula: C15H18Cl2N2O2
InChI: InChI=1/C15H18Cl2N2O2/c1-9(2)15(4,8-18)19-14(20)10(3)21-13-6-5-11(16)7-12(13)17/h5-7,9-10,19H,1-4H3
39 atoms
Cl 1.757653 -2.491656 -1.649547
Cl 3.879726 2.372115 -0.804752
O  0.352062 -2.026791 0.785022
O  -2.067224 -0.202088 2.580633
N  -1.919834 -0.551379 0.353594
N  -1.94108 2.771079 1.120766
C  -2.74633 0.570983 -0.064405
C  -2.529785 0.780976 -1.589285
C  -4.219847 0.33561 0.275266
C  -1.07888 1.096027 -1.941407
C  -3.449253 1.850842 -2.162858
C  -1.592236 -0.803817 1.62736
C  -0.572714 -1.919636 1.855896
C  -2.281709 1.785731 0.631832
C  -1.266917 -3.260852 1.98399
C  1.163333 -0.986279 0.505534
C  1.913419 -1.081283 -0.668989
C  1.288241 0.164049 1.276535
C  2.755533 -0.06308 -1.073546
C  2.122844 1.197175 0.876313
C  2.84749 1.080023 -0.294766
H  -2.800544 -0.179323 -2.041459
H  -1.492531 -1.099656 -0.379958
H  -4.601953 -0.479929 -0.338343
H  -4.343965 0.071031 1.322415
H  -4.817918 1.223757 0.082662
H  -0.97086 1.132337 -3.025336
H  -0.77204 2.068187 -1.551485
H  -0.37027 0.352295 -1.577065
H  -3.241586 1.970805 -3.226096
H  -4.503574 1.596934 -2.06817
H  -3.287512 2.821278 -1.689004
H  -0.053389 -1.689778 2.791608
H  -0.542458 -4.038554 2.222737
H  -1.786916 -3.533588 1.065807
H  -1.994746 -3.223321 2.793059
H  0.746421 0.284553 2.204458
H  3.321235 -0.160975 -1.98977
H  2.196801 2.08551 1.48782
elementType: Cl O N C H
totalener: -1762.90845418 hartree
nucrepener: 2044.97743897 hartree
electener: -3807.88589314 hartree
oneelecener: -6481.47513572 hartree
twoeener: 2673.58924258 hartree
cpcmener: -0.04115762 hartree
kineticenergy: 1757.83540416 hartree
xcener: -124.077362716868 hartree
chargesum: -0.0000000
charge: -0.081147 -0.093103 -0.328064 -0.527079 -0.187921 -0.091664 0.476645 0.031471 -0.313386 -0.275070 -0.306856 0.303981 0.161531 -0.354323 -0.280520 0.274308 -0.040074 -0.187808 -0.082270 -0.159189 0.054087 0.070163 0.176235 0.118439 0.117532 0.112157 0.107810 0.092655 0.064884 0.099721 0.100496 0.094621 0.120637 0.107162 0.105935 0.106537 0.141108 0.123518 0.146843
qa: -0.0811 -0.0931 -0.3281 -0.5271 -0.1879 -0.0917 0.4766 0.0315 -0.3134 -0.2751 -0.3069 0.3040 0.1615 -0.3543 -0.2805 0.2743 -0.0401 -0.1878 -0.0823 -0.1592 0.0541 0.0702 0.1762 0.1184 0.1175 0.1122 0.1078 0.0927 0.0649 0.0997 0.1005 0.0946 0.1206 0.1072 0.1059 0.1065 0.1411 0.1235 0.1468
va: 1.2332 1.2075 2.0798 1.9689 3.2559 3.1109 3.8233 3.8404 3.9165 3.9414 3.9549 4.0675 3.7917 4.1260 3.9540 3.8171 3.8948 3.8784 3.9972 4.0075 3.8633 1.0167 1.0233 1.0004 1.0199 0.9986 1.0074 1.0068 1.0185 1.0037 1.0021 1.0038 1.0102 1.0056 1.0048 1.0075 1.0211 1.0203 1.0040
dispcorr: -0.024398275 hartree
energy: -1762.932852450905
dipole: -34.98439 33.98141 -1.00298 -0.58144 -1.60036 -2.18180 -0.25280 -1.48468 -1.73748
magnitude: 2.96396 au
magnitude: 7.53379 debye
