program: Gaussian 09
title: 000064509
version: EM64L-G09RevD.01
frameworkgroup: C1[X(C15H18FN3O3)]
method: RPBEPBE
basis: SDD
operation: Freq
keyword: #p
keyword: freq=noraman
keyword: PBEPBE/SDD
title: #p freq=noraman PBEPBE/SDD
converged: YES YES NO NO
title: Mulliken charges:
elementType: F O O O N N N C C C C C C C C C C C C C C C H H H H H H H H H H H H H H H H H H
charge: -0.237230 -0.326361 -0.142114 -0.291468 -0.061761 -0.369175 -0.629987 0.262460 0.364505 -0.110802 -0.112214 -0.597856 -0.505409 -0.517582 -0.534220 -0.527546 -0.439293 0.123201 0.171538 0.114243 -0.206963 0.147352 0.214705 0.218151 0.242811 0.254689 0.213397 0.211498 0.231354 0.224051 0.222565 0.225569 0.223397 0.223464 0.203201 0.203435 0.346722 0.270006 0.362871 0.334797
chargesum: 0.00000
title: Mulliken charges with hydrogens summed into heavy atoms:
elementType: F O O O N N N C C C C C C C C C C C C C C C
charge: -0.237230 -0.326361 -0.142114 -0.291468 -0.061761 -0.022453 0.067681 0.262460 0.364505 0.103903 0.105937 -0.100356 -0.080514 -0.062177 -0.086086 -0.080686 -0.032658 0.123201 0.171538 0.114243 0.063043 0.147352
polarizability: 2.27032666e+02 2.84972479e+00 1.81834954e+02 4.35488590e+00 -4.44869541e+00 1.34886222e+02
1716.lowfreq: -16.3885 -10.9187 -8.9412 -0.0001 0.0004 0.0007 11.4323 23.2421 39.3172
frequency: 8.0403 22.8624 39.2750 62.2591 90.3695 124.7273 144.3365 166.6063 176.5803 219.6808 242.6103 247.6300 302.9595 316.9678 339.9715 354.9781 372.6027 385.7672 390.5227 391.8611 400.9558 428.9098 446.4967 477.3959 514.7759 544.5200 552.4749 575.2284 618.7242 625.8275 640.4620 646.2157 669.9530 679.5149 709.4936 729.7724 741.5275 760.6998 768.4404 788.7445 805.3426 829.5145 856.5408 871.2047 882.4711 891.1529 895.2477 922.3199 948.4196 959.6327 974.9512 980.6196 988.2815 1015.3136 1036.8009 1045.7827 1047.5409 1055.2509 1064.3636 1098.6592 1103.8753 1108.5912 1119.2800 1145.3778 1148.7540 1169.1358 1195.2906 1234.5830 1243.8098 1263.9909 1269.9537 1282.7043 1284.0946 1291.3013 1292.4968 1292.9400 1308.7431 1316.0504 1323.7718 1337.0139 1347.0918 1355.1219 1357.3132 1383.6531 1398.2987 1451.8163 1453.1779 1456.2400 1465.4391 1467.9745 1471.4610 1492.4492 1545.8641 1590.3280 1623.5067 1681.1984 2977.6703 2978.0329 2992.7971 2994.6103 2996.7638 3009.1498 3013.3270 3022.4931 3036.1471 3043.4271 3055.3331 3057.5258 3062.9105 3079.0668 3252.1776 3500.2971 3556.3593 3665.7955
redmass: 6.0125 6.2305 6.8469 7.9458 6.0928 5.5073 6.2906 5.9289 6.4987 3.9269 3.3222 3.4004 2.9038 7.8044 6.5015 3.2692 3.6375 4.2703 3.0986 4.3681 2.5507 2.7829 2.0880 2.2892 2.8293 1.3257 6.0126 1.2033 3.0417 4.3382 4.0012 5.2724 4.6997 6.2551 6.2845 8.0268 1.2737 4.0257 5.0539 3.4178 1.5109 2.7485 3.9050 1.6342 1.6643 1.7590 3.2017 7.0378 2.1086 2.4984 2.2084 2.1989 2.5158 4.1179 1.8170 1.6830 1.7174 1.8558 2.5176 1.0436 1.5583 1.1595 2.3669 1.7299 3.9373 1.1003 1.8037 2.1396 1.8280 1.6172 5.7636 1.7933 1.5189 1.7584 1.8258 3.4927 1.9579 1.5515 1.7119 1.4542 1.4460 1.6227 1.6655 3.1488 3.7277 1.1470 4.3164 1.0906 1.0886 1.0900 1.0948 1.0963 4.6728 2.0565 2.5149 12.6218 1.0610 1.0610 1.0622 1.0630 1.0608 1.0625 1.0814 1.0824 1.1031 1.1029 1.1035 1.1032 1.1033 1.1034 1.0995 1.0463 1.0823 1.1040
irintensity: 0.4573 0.2059 0.2051 0.5014 6.3362 3.1072 6.5562 15.6686 3.5341 11.3578 2.4502 4.7269 4.9997 11.5732 5.2534 2.7415 5.1034 0.0483 0.0483 1.6523 3.0931 0.1046 1.8442 2.4139 6.7182 90.1990 5.3806 110.3643 45.3228 9.6643 0.5799 3.6143 9.2314 11.0599 1.1845 7.5721 143.2796 4.3277 8.2723 8.2484 11.1384 10.7180 24.0604 2.7712 15.6114 25.7023 87.9798 12.7133 22.0933 46.5325 16.6476 15.4583 30.9525 193.5973 1.3055 3.5201 4.6172 55.5862 52.5937 0.1339 0.8021 7.4143 58.5247 39.3671 210.3348 12.9438 11.0452 3.5878 5.3099 5.6555 87.3753 1.2934 3.9412 5.1657 4.4332 3.2720 20.3431 3.9938 10.4362 2.9737 10.1442 6.6169 5.4849 112.0886 141.1770 9.8357 40.2677 0.8011 21.7952 19.2785 23.1585 0.8759 8.3438 243.3261 345.0496 166.5550 31.0852 25.7893 6.2184 4.4486 52.5572 33.5008 89.4550 54.7102 23.1915 23.0388 15.9025 23.7911 56.2974 21.7467 1.8019 64.4901 102.9402 79.8320
temp: 298.150 k
press: 1.00000 atm
elementType: 9 8 8 8 7 7 7 6 6 6 6 6 6 6 6 6 6 6 6 6 6 6 1 1 1 1 1 1 1 1 1 1 1 1 1 1 1 1 1 1
symmnumber: 1
zpe: 840117.8 jmol-1
zpe.correction: 0.319984 hartree
zpe.thermalcorrener: 0.338527 hartree
zpe.thermalcorrenthalpy: 0.339471 hartree
zpe.thermalcorrgfe: 0.271247 hartree
zpe.sumelectzpe: -1070.581092 hartree
zpe.sumelectthermal: -1070.562549 hartree
zpe.sumelectthermalent: -1070.561605 hartree
zpe.sumelectthermalfe: -1070.629829 hartree
dipole: 1.5804 2.6481 0.5221
dipole: 3.1277
quadrupole: -126.1192 -125.6256 -137.8982
quadrupole: 20.0713 10.5167 -2.1419
quadrupole: 3.7618 4.2554 -8.0172 20.0713 10.5167 -2.1419
hfenergy: -1070.9010761 hartree
pointgroup: C01 [X(C15H18F1N3O3)]
dipole: 0.6927498 -0.3553014 -0.9529389 debye
polarizability: 227.3281272|2.1436113|151.6790032|-1.0322579|23.0046824|164.7467109 unknown
InChI: InChI=1S/C15H18FN3O3/c16-15-4-8-1-9(5-15)3-14(2-8,6-15)13(21)22-12-10(11(17)20)18-7-19-12/h7-9,18H,1-6,17H2
charge 0 multiplicity 1
40 atoms
F  3.450834 -1.03378 2.587892
O  -1.10222 -0.06839 0.206695
O  -0.597981 2.188441 -0.222852
O  -4.962012 -1.338501 -1.777188
N  -2.796575 0.961077 1.645081
N  -4.643423 0.216566 0.574357
N  -2.64047 -1.580123 -1.97233
C  1.239326 0.517505 -0.09971
C  3.095345 -0.520809 1.24663
C  2.855104 -1.134796 -1.169962
C  3.66095 1.17485 -0.506236
C  1.63638 -0.034417 1.31457
C  1.383976 -0.639536 -1.144128
C  2.195646 1.683135 -0.482319
C  3.240747 -1.672616 0.23941
C  4.047678 0.634417 0.90211
C  3.799911 0.036141 -1.552682
C  -0.195509 1.03035 -0.055953
C  -2.436727 0.22214 0.531935
C  -3.555997 -0.264001 -0.16298
C  -4.152015 0.944179 1.640114
C  -3.781386 -1.096109 -1.361815
H  2.948274 -1.951296 -1.911154
H  4.330978 2.013812 -0.772065
H  1.542771 0.760096 2.077717
H  0.971042 -0.866329 1.604135
H  1.090324 -0.273872 -2.147907
H  0.709385 -1.472531 -0.870195
H  2.081602 2.509729 0.243352
H  1.91239 2.08792 -1.472114
H  2.583597 -2.511904 0.53524
H  4.283328 -2.041106 0.243576
H  5.092498 0.271898 0.909594
H  3.960728 1.430529 1.664998
H  4.847558 -0.321054 -1.591554
H  3.544861 0.415902 -2.561485
H  -5.611809 0.023913 0.308557
H  -4.781501 1.433507 2.378107
H  -1.714736 -1.388835 -1.586027
H  -2.744171 -2.1574 -2.805113
