program: Orca
programVersion: 5.0.2
elementType: Cl Cl O O N N C C C C C C C C C C C C C C C H H H H H H H H H H H H H H H H H H
charge: 0
multiplicity: 1
keywords: wb97x-d3
keywords: def2-TZVPP
keywords: def2/J RIJCOSX
keywords: DEFGRID2
keywords: scfconv7
keywords: smallprint printgap noloewdin
keywords: NOSOSCF
formula: C15H18Cl2N2O2
InChI: InChI=1/C15H18Cl2N2O2/c1-9(2)15(4,8-18)19-14(20)10(3)21-13-6-5-11(16)7-12(13)17/h5-7,9-10,19H,1-4H3
39 atoms
Cl 1.362147 -2.314227 -1.815953
Cl 4.029478 2.253937 -0.859338
O  0.376484 -1.997969 0.845016
O  -1.701167 0.10453 2.69056
N  -1.867626 -0.444401 0.499954
N  -1.064764 2.812032 0.688773
C  -2.562977 0.751393 0.04233
C  -2.627512 0.689375 -1.512082
C  -3.943961 0.908423 0.681398
C  -3.078129 2.00328 -2.137281
C  -3.51592 -0.45282 -1.995285
C  -1.4143 -0.62221 1.750978
C  -0.503539 -1.835345 1.949513
C  -1.727854 1.911107 0.414589
C  -1.308369 -3.112655 2.074664
C  1.218076 -0.991146 0.528855
C  1.779162 -1.02353 -0.749637
C  1.55126 0.063564 1.37082
C  2.649701 -0.039561 -1.180669
C  2.414902 1.062795 0.946285
C  2.956973 1.006124 -0.32372
H  -1.602829 0.495039 -1.847499
H  -1.52781 -1.064624 -0.222513
H  -4.473229 1.756949 0.249744
H  -4.533286 0.009713 0.507675
H  -3.876608 1.068991 1.754328
H  -2.434731 2.841893 -1.869517
H  -3.048273 1.911685 -3.223249
H  -4.102126 2.259498 -1.862423
H  -3.429256 -0.538363 -3.078615
H  -3.242767 -1.422474 -1.577313
H  -4.566425 -0.271404 -1.766219
H  0.059121 -1.669471 2.872542
H  -0.651151 -3.954115 2.291976
H  -1.865437 -3.328937 1.163186
H  -2.017137 -3.022583 2.89691
H  1.158092 0.127653 2.376269
H  3.069103 -0.085615 -2.176508
H  2.658732 1.874194 1.617711
elementType: Cl O N C H
totalener: -1762.90608734 hartree
nucrepener: 2036.72921394 hartree
electener: -3799.63530128 hartree
oneelecener: -6465.34610715 hartree
twoeener: 2665.71080587 hartree
cpcmener: -0.04055995 hartree
kineticenergy: 1757.82335353 hartree
xcener: -124.072315029582 hartree
chargesum: 0.0000000
charge: -0.080905 -0.092288 -0.333572 -0.517341 -0.197092 -0.102815 0.439609 0.049531 -0.329562 -0.299155 -0.303179 0.287890 0.179513 -0.316031 -0.284566 0.275120 -0.054947 -0.175200 -0.084544 -0.177799 0.067402 0.068853 0.174741 0.122157 0.115481 0.119946 0.095339 0.101946 0.092686 0.105909 0.097238 0.095262 0.120117 0.108238 0.104528 0.107939 0.144832 0.125636 0.149085
qa: -0.0809 -0.0923 -0.3336 -0.5173 -0.1971 -0.1028 0.4396 0.0495 -0.3296 -0.2992 -0.3032 0.2879 0.1795 -0.3160 -0.2846 0.2751 -0.0549 -0.1752 -0.0845 -0.1778 0.0674 0.0689 0.1747 0.1222 0.1155 0.1199 0.0953 0.1019 0.0927 0.1059 0.0972 0.0953 0.1201 0.1082 0.1045 0.1079 0.1448 0.1256 0.1491
va: 1.2317 1.2095 2.0742 1.9841 3.2367 3.1101 3.8685 3.8440 3.9236 3.9432 3.9437 4.0940 3.7599 4.0646 3.9631 3.8104 3.9226 3.8734 4.0086 4.0024 3.8546 1.0163 1.0274 1.0006 0.9965 1.0215 1.0110 1.0014 1.0025 1.0026 1.0065 0.9980 1.0077 1.0052 1.0046 1.0056 1.0181 1.0189 1.0026
dispcorr: -0.023362208 hartree
energy: -1762.929449545910
dipole: -39.42911 37.73629 -1.69282 -2.82581 0.57835 -2.24746 1.92466 -3.15088 -1.22622
magnitude: 3.06926 au
magnitude: 7.80144 debye
