program: Orca
programVersion: 5.0.2
elementType: Cl Cl O O N N C C C C C C C C C C C C C C C H H H H H H H H H H H H H H H H H H
charge: 0
multiplicity: 1
keywords: wb97x-d3
keywords: def2-TZVPP
keywords: def2/J RIJCOSX
keywords: DEFGRID2
keywords: scfconv7
keywords: smallprint printgap noloewdin
keywords: NOSOSCF
formula: C15H18Cl2N2O2
InChI: InChI=1/C15H18Cl2N2O2/c1-9(2)15(4,8-18)19-14(20)10(3)21-13-6-5-11(16)7-12(13)17/h5-7,9-10,19H,1-4H3
39 atoms
Cl 1.503354 -2.351634 -1.773569
Cl 4.037833 2.288457 -0.807567
O  0.381889 -1.989872 0.82068
O  -1.808279 0.011359 2.673019
N  -1.856497 -0.447328 0.456978
N  -1.162651 2.816887 0.812826
C  -2.572287 0.744045 0.022341
C  -2.569103 0.746546 -1.535339
C  -3.982328 0.82434 0.607971
C  -3.033167 2.069911 -2.128605
C  -3.398461 -0.401131 -2.103578
C  -1.454757 -0.663217 1.721575
C  -0.510989 -1.852537 1.91625
C  -1.78731 1.911472 0.478711
C  -1.284622 -3.150169 2.029675
C  1.222057 -0.977941 0.527711
C  1.846835 -1.028527 -0.721025
C  1.496618 0.103121 1.358343
C  2.718591 -0.039047 -1.133891
C  2.360212 1.108921 0.950095
C  2.964604 1.033222 -0.290523
H  -1.52462 0.597568 -1.832447
H  -1.461173 -1.022474 -0.27388
H  -4.524941 1.670143 0.189007
H  -4.529644 -0.087405 0.375983
H  -3.962457 0.942779 1.687303
H  -4.076881 2.282913 -1.895057
H  -2.430513 2.915184 -1.796403
H  -2.948833 2.024734 -3.214596
H  -4.464588 -0.25463 -1.927639
H  -3.251942 -0.4489 -3.183043
H  -3.123199 -1.376836 -1.700857
H  0.039097 -1.677148 2.84596
H  -1.991968 -3.086257 2.855833
H  -0.606531 -3.97826 2.234579
H  -1.840695 -3.370272 1.118152
H  1.051075 0.188723 2.339829
H  3.188544 -0.102323 -2.105578
H  2.551808 1.942929 1.61082
elementType: Cl O N C H
totalener: -1762.91519700 hartree
nucrepener: 2033.58545878 hartree
electener: -3796.50065578 hartree
oneelecener: -6458.96160018 hartree
twoeener: 2662.46094440 hartree
cpcmener: -0.03333676 hartree
kineticenergy: 1757.84540051 hartree
xcener: -124.074939166227 hartree
chargesum: -0.0000000
charge: -0.080528 -0.090594 -0.323878 -0.482405 -0.200855 -0.087985 0.440081 0.043358 -0.331499 -0.297352 -0.301214 0.270040 0.168525 -0.322942 -0.281338 0.277554 -0.059705 -0.181599 -0.082322 -0.163624 0.060729 0.068195 0.170364 0.120188 0.113350 0.122784 0.091177 0.097542 0.100843 0.094591 0.105910 0.095643 0.118792 0.107237 0.106946 0.102538 0.141131 0.123707 0.146613
qa: -0.0805 -0.0906 -0.3239 -0.4824 -0.2009 -0.0880 0.4401 0.0434 -0.3315 -0.2974 -0.3012 0.2700 0.1685 -0.3229 -0.2813 0.2776 -0.0597 -0.1816 -0.0823 -0.1636 0.0607 0.0682 0.1704 0.1202 0.1134 0.1228 0.0912 0.0975 0.1008 0.0946 0.1059 0.0956 0.1188 0.1072 0.1069 0.1025 0.1411 0.1237 0.1466
va: 1.2333 1.2113 2.0827 2.0288 3.2226 3.1126 3.8715 3.8489 3.9218 3.9442 3.9413 4.1192 3.7725 4.0614 3.9582 3.8108 3.9243 3.8751 4.0064 4.0042 3.8686 1.0155 1.0304 1.0012 0.9967 1.0221 1.0027 1.0113 1.0016 0.9981 1.0031 1.0074 1.0088 1.0061 1.0059 1.0053 1.0208 1.0196 1.0034
dispcorr: -0.023252628 hartree
energy: -1762.938449631275
dipole: -39.34108 37.83020 -1.51089 -2.66405 0.60410 -2.05995 1.02080 -2.27130 -1.25050
magnitude: 2.84428 au
magnitude: 7.22959 debye
