program: Orca
programVersion: 5.0.2
elementType: Cl Cl O O N N C C C C C C C C C C C C C C C H H H H H H H H H H H H H H H H H H
charge: 0
multiplicity: 1
keywords: wb97x-d3
keywords: def2-TZVPP
keywords: def2/J RIJCOSX
keywords: DEFGRID2
keywords: scfconv7
keywords: smallprint printgap noloewdin
keywords: NOSOSCF
formula: C15H18Cl2N2O2
InChI: InChI=1/C15H18Cl2N2O2/c1-9(2)15(4,8-18)19-14(20)10(3)21-13-6-5-11(16)7-12(13)17/h5-7,9-10,19H,1-4H3
39 atoms
Cl 2.440732 -1.804262 -1.817938
Cl 4.181704 2.512819 0.868333
O  0.486785 -1.985346 0.23733
O  -2.537561 -0.850403 1.685854
N  -1.73173 -0.531951 -0.401022
N  -5.1231 -0.479076 -0.426326
C  -2.704431 0.459325 -0.832926
C  -2.527168 1.810964 -0.083324
C  -2.564864 0.603399 -2.350495
C  -3.611562 2.822607 -0.436748
C  -1.145434 2.405337 -0.326208
C  -1.723794 -1.102356 0.813412
C  -0.661852 -2.177178 1.043975
C  -4.056632 -0.07474 -0.570527
C  -1.229187 -3.540022 0.695079
C  1.297116 -0.935354 0.462619
C  2.311064 -0.727482 -0.476089
C  1.198688 -0.055758 1.534415
C  3.202132 0.321675 -0.356368
C  2.084724 1.004752 1.662516
C  3.078291 1.187809 0.719113
H  -2.619442 1.591128 0.982129
H  -1.072985 -0.84934 -1.097316
H  -2.727394 -0.354111 -2.845374
H  -3.286296 1.313471 -2.74755
H  -1.564425 0.952647 -2.604198
H  -3.546612 3.153983 -1.474274
H  -4.619868 2.441038 -0.267222
H  -3.499226 3.70762 0.190752
H  -1.029673 2.776419 -1.345848
H  -0.994454 3.2539 0.342612
H  -0.340157 1.697085 -0.129015
H  -0.400597 -2.158574 2.1066
H  -2.112081 -3.739316 1.301048
H  -0.49846 -4.320506 0.90483
H  -1.514144 -3.598913 -0.355619
H  0.432976 -0.168334 2.290211
H  3.977542 0.460873 -1.097588
H  1.983137 1.681085 2.500101
elementType: Cl O N C H
totalener: -1762.91728080 hartree
nucrepener: 2011.58018480 hartree
electener: -3774.49746560 hartree
oneelecener: -6414.13566595 hartree
twoeener: 2639.63820034 hartree
cpcmener: -0.03439844 hartree
kineticenergy: 1757.84373049 hartree
xcener: -124.076813165357 hartree
chargesum: -0.0000000
charge: -0.077723 -0.090686 -0.321159 -0.494138 -0.201764 -0.084904 0.424498 0.038698 -0.325878 -0.302231 -0.307994 0.293880 0.151135 -0.301802 -0.275064 0.286698 -0.049910 -0.187094 -0.094164 -0.169471 0.067900 0.073633 0.173906 0.131109 0.116926 0.122621 0.089543 0.098167 0.102096 0.095194 0.108187 0.068597 0.118140 0.106331 0.105160 0.103737 0.137783 0.123986 0.146060
qa: -0.0777 -0.0907 -0.3212 -0.4941 -0.2018 -0.0849 0.4245 0.0387 -0.3259 -0.3022 -0.3080 0.2939 0.1511 -0.3018 -0.2751 0.2867 -0.0499 -0.1871 -0.0942 -0.1695 0.0679 0.0736 0.1739 0.1311 0.1169 0.1226 0.0895 0.0982 0.1021 0.0952 0.1082 0.0686 0.1181 0.1063 0.1052 0.1037 0.1378 0.1240 0.1461
va: 1.2370 1.2103 2.0834 2.0200 3.2105 3.1216 3.9102 3.7996 3.9447 3.9436 3.9379 4.0834 3.8222 4.0732 3.9463 3.7983 3.9354 3.8668 4.0203 3.9953 3.8539 1.0355 1.0219 1.0040 1.0010 0.9928 1.0004 1.0100 1.0014 1.0018 1.0029 1.0174 1.0096 1.0095 1.0068 1.0056 1.0173 1.0195 1.0037
dispcorr: -0.023281173 hartree
energy: -1762.940561969410
dipole: -30.83760 32.54319 1.70559 6.46289 -5.95102 0.51187 -1.84645 0.88505 -0.96140
magnitude: 2.02369 au
magnitude: 5.14382 debye
