program: Orca
programVersion: 5.0.2
elementType: Cl Cl O O N N C C C C C C C C C C C C C C C H H H H H H H H H H H H H H H H H H
charge: 0
multiplicity: 1
keywords: wb97x-d3
keywords: def2-TZVPP
keywords: def2/J RIJCOSX
keywords: DEFGRID2
keywords: scfconv7
keywords: smallprint printgap noloewdin
keywords: NOSOSCF
formula: C15H18Cl2N2O2
InChI: InChI=1/C15H18Cl2N2O2/c1-9(2)15(4,8-18)19-14(20)10(3)21-13-6-5-11(16)7-12(13)17/h5-7,9-10,19H,1-4H3
39 atoms
Cl 1.364265 -2.287553 -1.82181
Cl 3.905745 2.345153 -0.833503
O  0.318582 -1.983277 0.813997
O  -1.755228 0.084763 2.694292
N  -1.919972 -0.409169 0.49253
N  -1.108074 2.866633 0.737375
C  -2.599032 0.80635 0.075892
C  -2.714102 0.831617 -1.474878
C  -3.972331 0.9709 0.735633
C  -3.694836 -0.212711 -1.9979
C  -1.365534 0.700656 -2.17891
C  -1.474779 -0.623447 1.743175
C  -0.571898 -1.848071 1.912785
C  -1.761259 1.959064 0.469531
C  -1.384966 -3.124423 1.989308
C  1.150658 -0.965419 0.51721
C  1.735608 -0.985905 -0.750889
C  1.456809 0.091675 1.367125
C  2.586993 0.018546 -1.170613
C  2.302471 1.110855 0.954421
C  2.859077 1.071182 -0.310001
H  -3.120845 1.819313 -1.709804
H  -1.613102 -1.038079 -0.235705
H  -4.553879 0.059466 0.610151
H  -3.888014 1.175759 1.799651
H  -4.512831 1.796271 0.272247
H  -3.727759 -0.161354 -3.08695
H  -3.402267 -1.231436 -1.734555
H  -4.710402 -0.049723 -1.639451
H  -0.608846 1.377177 -1.778643
H  -0.96586 -0.314625 -2.139614
H  -1.486054 0.94375 -3.235038
H  -0.01838 -1.713139 2.847079
H  -0.734202 -3.978795 2.174439
H  -1.943648 -3.304034 1.070305
H  -2.094344 -3.061268 2.814002
H  1.050074 0.14586 2.367608
H  3.021908 -0.018041 -2.16008
H  2.519243 1.927003 1.629774
elementType: Cl O N C H
totalener: -1762.91472712 hartree
nucrepener: 2064.19854033 hartree
electener: -3827.11326744 hartree
oneelecener: -6520.31221423 hartree
twoeener: 2693.19894678 hartree
cpcmener: -0.03318276 hartree
kineticenergy: 1757.83566581 hartree
xcener: -124.074116735894 hartree
chargesum: -0.0000000
charge: -0.084177 -0.090230 -0.323886 -0.477606 -0.238726 -0.077614 0.494887 0.038651 -0.316632 -0.299448 -0.307911 0.265961 0.173103 -0.347116 -0.283417 0.282923 -0.059466 -0.173928 -0.088865 -0.171838 0.070665 0.064066 0.177140 0.110040 0.121661 0.119276 0.103514 0.089916 0.100893 0.098448 0.071116 0.113079 0.117540 0.107520 0.101972 0.107985 0.140620 0.123386 0.146499
qa: -0.0842 -0.0902 -0.3239 -0.4776 -0.2387 -0.0776 0.4949 0.0387 -0.3166 -0.2994 -0.3079 0.2660 0.1731 -0.3471 -0.2834 0.2829 -0.0595 -0.1739 -0.0889 -0.1718 0.0707 0.0641 0.1771 0.1100 0.1217 0.1193 0.1035 0.0899 0.1009 0.0984 0.0711 0.1131 0.1175 0.1075 0.1020 0.1080 0.1406 0.1234 0.1465
va: 1.2260 1.2112 2.0812 2.0350 3.2652 3.1130 3.8264 3.8002 3.8953 3.9503 3.9679 4.1200 3.7586 4.0990 3.9636 3.8013 3.8883 3.8793 4.0029 4.0018 3.8591 1.0181 1.0258 0.9977 1.0212 1.0026 1.0028 1.0028 1.0018 1.0032 1.0108 1.0059 1.0087 1.0057 1.0046 1.0053 1.0214 1.0200 1.0037
dispcorr: -0.025094214 hartree
energy: -1762.939821331798
dipole: -36.03844 34.35355 -1.68489 -5.28457 3.17416 -2.11041 1.63433 -2.76826 -1.13393
magnitude: 2.92891 au
magnitude: 7.44470 debye
