program: Orca
programVersion: 5.0.2
elementType: Cl Cl O O N N C C C C C C C C C C C C C C C H H H H H H H H H H H H H H H H H H
charge: 0
multiplicity: 1
keywords: wb97x-d3
keywords: def2-TZVPP
keywords: def2/J RIJCOSX
keywords: DEFGRID2
keywords: scfconv7
keywords: smallprint printgap noloewdin
keywords: NOSOSCF
formula: C15H18Cl2N2O2
InChI: InChI=1/C15H18Cl2N2O2/c1-9(2)15(4,8-18)19-14(20)10(3)21-13-6-5-11(16)7-12(13)17/h5-7,9-10,19H,1-4H3
39 atoms
Cl 1.789335 -2.483762 -1.633087
Cl 3.920757 2.363974 -0.728216
O  0.339972 -2.020817 0.765734
O  -2.154311 -0.290052 2.563315
N  -1.904199 -0.541031 0.327168
N  -1.975635 2.795765 1.085778
C  -2.741622 0.574864 -0.082449
C  -2.524417 0.791603 -1.606795
C  -4.210363 0.298716 0.252628
C  -1.079265 1.148217 -1.953033
C  -3.465496 1.842852 -2.183765
C  -1.624423 -0.828374 1.617861
C  -0.58101 -1.928622 1.834813
C  -2.306874 1.800303 0.616397
C  -1.256881 -3.281143 1.964178
C  1.158548 -0.980094 0.509372
C  1.936017 -1.079302 -0.646785
C  1.256044 0.175472 1.275948
C  2.792165 -0.062825 -1.024944
C  2.104734 1.204715 0.896985
C  2.870108 1.082501 -0.247437
H  -2.772229 -0.172131 -2.069653
H  -1.38823 -1.018581 -0.393856
H  -4.835025 1.164003 0.041857
H  -4.565671 -0.542532 -0.343591
H  -4.321939 0.056279 1.305872
H  -0.807213 2.12471 -1.551442
H  -0.34411 0.432651 -1.58481
H  -0.962299 1.192788 -3.035548
H  -3.253132 1.981137 -3.243659
H  -4.513974 1.562174 -2.101207
H  -3.33039 2.809807 -1.696339
H  -0.066721 -1.692485 2.77327
H  -0.520758 -4.056044 2.173013
H  -1.790078 -3.549301 1.052166
H  -1.970739 -3.257285 2.785609
H  0.664872 0.311778 2.171101
H  3.382799 -0.16304 -1.924373
H  2.153178 2.10261 1.496031
totalener: -1762.89066470 hartree
nucrepener: 2042.92732589 hartree
electener: -3805.81799059 hartree
oneelecener: -6477.57443998 hartree
twoeener: 2671.75644939 hartree
kineticenergy: 1757.90481970 hartree
xcener: -124.083350673830 hartree
chargesum: 0.0000000
charge: -0.059946 -0.068569 -0.296400 -0.368824 -0.208091 0.009911 0.459573 -0.038017 -0.314443 -0.219443 -0.293308 0.238431 0.111714 -0.385230 -0.267509 0.234580 -0.045427 -0.160182 -0.084565 -0.143718 0.053958 0.059515 0.145114 0.102333 0.100182 0.133225 0.104958 0.036050 0.096236 0.089845 0.090763 0.106492 0.108922 0.101337 0.091508 0.108769 0.128530 0.112939 0.128787
qa: -0.0599 -0.0686 -0.2964 -0.3688 -0.2081 0.0099 0.4596 -0.0380 -0.3144 -0.2194 -0.2933 0.2384 0.1117 -0.3852 -0.2675 0.2346 -0.0454 -0.1602 -0.0846 -0.1437 0.0540 0.0595 0.1451 0.1023 0.1002 0.1332 0.1050 0.0360 0.0962 0.0898 0.0908 0.1065 0.1089 0.1013 0.0915 0.1088 0.1285 0.1129 0.1288
va: 1.2570 1.2324 2.0962 2.1396 3.1822 3.1200 3.8559 3.8954 3.9038 3.9253 3.9591 4.1240 3.8486 4.0662 3.9454 3.8175 3.9273 3.8958 3.9970 4.0609 3.9364 1.0129 1.0501 1.0025 1.0036 1.0225 1.0097 1.0329 1.0109 1.0078 1.0032 1.0059 1.0115 1.0096 1.0092 1.0077 1.0247 1.0249 1.0115
dispcorr: -0.024292367 hartree
energy: -1762.914957070692
dipole: -35.03517 34.42830 -0.60687 -0.47666 -0.88331 -1.35997 -0.65631 -0.38554 -1.04184
magnitude: 1.81749 au
magnitude: 4.61968 debye
