program: Orca
programVersion: 5.0.2
elementType: Cl Cl O O N N C C C C C C C C C C C C C C C H H H H H H H H H H H H H H H H H H
charge: 0
multiplicity: 1
keywords: wb97x-d3
keywords: def2-TZVPP
keywords: def2/J RIJCOSX
keywords: DEFGRID2
keywords: scfconv7
keywords: smallprint printgap noloewdin
keywords: NOSOSCF
formula: C15H18Cl2N2O2
InChI: InChI=1/C15H18Cl2N2O2/c1-9(2)15(4,8-18)19-14(20)10(3)21-13-6-5-11(16)7-12(13)17/h5-7,9-10,19H,1-4H3
39 atoms
Cl 2.085438 -2.111225 -1.926184
Cl 4.918654 1.837437 0.361666
O  0.3735 -1.855353 0.329428
O  -2.004438 -0.151376 2.274982
N  -1.726538 -0.140933 0.016584
N  -2.364816 1.331864 -2.896171
C  -2.508869 1.056111 -0.294135
C  -4.004087 0.889763 0.10181
C  -1.864209 2.299483 0.339564
C  -4.614551 -0.374221 -0.492834
C  -4.835067 2.110399 -0.28268
C  -1.514665 -0.608278 1.263893
C  -0.623688 -1.85419 1.33107
C  -2.427083 1.205571 -1.755523
C  -1.458036 -3.107731 1.138641
C  1.385969 -0.968302 0.408887
C  2.31175 -0.993885 -0.637428
C  1.570281 -0.048477 1.434322
C  3.39388 -0.135413 -0.656669
C  2.65596 0.816324 1.421627
C  3.564131 0.767873 0.381563
H  -4.010445 0.801608 1.189652
H  -1.241173 -0.592449 -0.742914
H  -2.001872 2.28304 1.418302
H  -0.797003 2.317399 0.122107
H  -2.301753 3.213782 -0.054993
H  -5.639687 -0.490279 -0.140785
H  -4.648606 -0.333005 -1.583469
H  -4.072074 -1.274025 -0.20465
H  -5.869575 1.958425 0.02512
H  -4.491642 3.023209 0.202012
H  -4.839578 2.278631 -1.361251
H  -0.175364 -1.871903 2.330399
H  -0.841319 -3.997146 1.258757
H  -1.913618 -3.137516 0.148862
H  -2.251544 -3.140129 1.883663
H  0.876862 0.018643 2.261464
H  4.095555 -0.172284 -1.477866
H  2.785285 1.52426 2.227896
totalener: -1762.89142736 hartree
nucrepener: 1985.49249179 hartree
electener: -3748.38391915 hartree
oneelecener: -6362.53630417 hartree
twoeener: 2614.15238502 hartree
kineticenergy: 1757.88969184 hartree
xcener: -124.077917178334 hartree
chargesum: -0.0000000
charge: -0.053014 -0.069515 -0.303401 -0.387709 -0.191852 0.026077 0.414838 -0.012435 -0.308783 -0.279745 -0.281723 0.204195 0.139902 -0.384207 -0.280421 0.304791 -0.077490 -0.185545 -0.077584 -0.160380 0.051719 0.075963 0.154823 0.127807 0.110628 0.107583 0.091839 0.094536 0.085729 0.090747 0.091527 0.099581 0.111052 0.106230 0.091163 0.108912 0.123796 0.115138 0.125230
qa: -0.0530 -0.0695 -0.3034 -0.3877 -0.1919 0.0261 0.4148 -0.0124 -0.3088 -0.2797 -0.2817 0.2042 0.1399 -0.3842 -0.2804 0.3048 -0.0775 -0.1855 -0.0776 -0.1604 0.0517 0.0760 0.1548 0.1278 0.1106 0.1076 0.0918 0.0945 0.0857 0.0907 0.0915 0.0996 0.1111 0.1062 0.0912 0.1089 0.1238 0.1151 0.1252
va: 1.2628 1.2325 2.0954 2.1247 3.1539 3.1271 3.8595 3.8032 3.9087 3.9537 3.9387 4.1307 3.8035 4.0354 3.9503 3.7753 4.0081 3.9097 3.9938 4.0643 3.9444 1.0359 1.0422 1.0108 1.0132 1.0054 1.0066 1.0056 1.0100 1.0063 1.0043 1.0059 1.0115 1.0118 1.0093 1.0056 1.0280 1.0219 1.0119
dispcorr: -0.022426693 hartree
energy: -1762.913854052706
dipole: -45.32306 44.78614 -0.53692 3.03951 -3.43146 -0.39195 9.25212 -8.22767 1.02445
magnitude: 1.22123 au
magnitude: 3.10413 debye
