program: Orca
programVersion: 5.0.2
elementType: Cl Cl O O N N C C C C C C C C C C C C C C C H H H H H H H H H H H H H H H H H H
charge: 0
multiplicity: 1
keywords: wb97x-d3
keywords: def2-TZVPP
keywords: def2/J RIJCOSX
keywords: DEFGRID2
keywords: scfconv7
keywords: smallprint printgap noloewdin
keywords: NOSOSCF
formula: C15H18Cl2N2O2
InChI: InChI=1/C15H18Cl2N2O2/c1-9(2)15(4,8-18)19-14(20)10(3)21-13-6-5-11(16)7-12(13)17/h5-7,9-10,19H,1-4H3
39 atoms
Cl 1.711979 -2.269314 -1.67508
Cl 3.902497 2.509024 -0.573275
O  0.326981 -1.926464 0.782899
O  -2.144789 -0.18466 2.577974
N  -1.92588 -0.455128 0.337993
N  -1.50895 2.843685 1.026681
C  -2.647013 0.741113 -0.063382
C  -2.514079 0.918244 -1.601691
C  -4.115201 0.697711 0.374002
C  -3.254874 -0.165829 -2.380196
C  -1.060957 1.011816 -2.068576
C  -1.636838 -0.738357 1.630088
C  -0.613509 -1.858793 1.837473
C  -2.010032 1.916185 0.56909
C  -1.305848 -3.206833 1.912296
C  1.140371 -0.873363 0.556284
C  1.896372 -0.920764 -0.617122
C  1.252814 0.2475 1.370364
C  2.751897 0.106698 -0.962924
C  2.099113 1.290476 1.023638
C  2.849219 1.214437 -0.134582
H  -2.994387 1.876505 -1.820514
H  -1.382647 -0.91709 -0.373473
H  -4.201596 0.749025 1.455361
H  -4.661698 1.537005 -0.056644
H  -4.575371 -0.229235 0.037607
H  -2.878712 -1.166421 -2.158215
H  -4.326602 -0.162214 -2.188903
H  -3.117871 -0.005283 -3.449527
H  -0.545327 0.048777 -2.046445
H  -1.032916 1.348671 -3.104513
H  -0.474399 1.71713 -1.480084
H  -0.116151 -1.65566 2.792441
H  -1.822997 -3.441201 0.982095
H  -2.037098 -3.198354 2.718884
H  -0.583743 -3.996531 2.113982
H  0.673438 0.347243 2.277906
H  3.32597 0.045954 -1.876473
H  2.157605 2.162804 1.658374
totalener: -1762.88970423 hartree
nucrepener: 2061.05476168 hartree
electener: -3823.94446591 hartree
oneelecener: -6513.89807676 hartree
twoeener: 2689.95361086 hartree
kineticenergy: 1757.90114403 hartree
xcener: -124.081752858504 hartree
chargesum: 0.0000000
charge: -0.066153 -0.069318 -0.297518 -0.365434 -0.254078 0.012063 0.470287 -0.006776 -0.314364 -0.276267 -0.285258 0.232856 0.117673 -0.374420 -0.268186 0.296192 -0.099998 -0.184634 -0.062703 -0.124401 0.040835 0.057686 0.149021 0.137278 0.106981 0.096351 0.081654 0.095286 0.098715 0.058585 0.104108 0.114518 0.110050 0.091859 0.107693 0.101607 0.127802 0.112793 0.127617
qa: -0.0662 -0.0693 -0.2975 -0.3654 -0.2541 0.0121 0.4703 -0.0068 -0.3144 -0.2763 -0.2853 0.2329 0.1177 -0.3744 -0.2682 0.2962 -0.1000 -0.1846 -0.0627 -0.1244 0.0408 0.0577 0.1490 0.1373 0.1070 0.0964 0.0817 0.0953 0.0987 0.0586 0.1041 0.1145 0.1101 0.0919 0.1077 0.1016 0.1278 0.1128 0.1276
va: 1.2468 1.2313 2.0942 2.1476 3.2146 3.1216 3.8824 3.8504 3.8911 3.9497 3.9646 4.1383 3.8273 4.0427 3.9488 3.7507 3.9343 3.9136 3.9730 4.0393 3.9390 1.0165 1.0571 1.0222 1.0051 1.0017 1.0064 1.0038 1.0071 1.0109 1.0091 1.0040 1.0109 1.0090 1.0069 1.0093 1.0262 1.0235 1.0119
dispcorr: -0.025130433 hartree
energy: -1762.914834663171
dipole: -34.70810 33.90440 -0.80370 -5.30940 3.98099 -1.32842 -1.42227 0.41877 -1.00349
magnitude: 1.84869 au
magnitude: 4.69898 debye
