program: Orca
programVersion: 5.0.2
elementType: Cl Cl O N N C C C C C C C C C C C C C C C H H H H H H H H H H H H H H H H H H
charge: 0
multiplicity: 1
keywords: wb97x-d3
keywords: def2-TZVPP
keywords: def2/J RIJCOSX
keywords: DEFGRID2
keywords: scfconv7
keywords: smallprint printgap noloewdin
keywords: NOSOSCF
formula: C15H18Cl2N2O
InChI: InChI=1/C15H18Cl2N2O/c1-9(11-6-5-10(16)7-13(11)17)19-14(20)12(8-18)15(2,3)4/h5-7,9,12,19H,1-4H3
38 atoms
Cl 0.910064 0.144857 -2.145953
Cl 5.165679 1.513922 0.787169
O  -2.355305 -1.576608 -1.132393
N  -0.908393 -1.050616 0.526176
N  -5.445574 -1.147131 0.362031
C  -3.111897 1.417007 -0.01788
C  -3.095007 -0.037109 0.557911
C  -1.729969 2.042459 0.160513
C  -3.500359 1.433548 -1.493539
C  -4.126737 2.222495 0.79346
C  -2.078803 -0.966786 -0.107526
C  0.213655 -1.859787 0.071158
C  1.474848 -1.040754 0.233707
C  -4.405701 -0.658683 0.440087
C  0.243239 -3.205763 0.779101
C  1.857801 -0.092927 -0.714058
C  2.276805 -1.159988 1.363893
C  2.988305 0.693703 -0.563563
C  3.409778 -0.385155 1.550157
C  3.755085 0.536867 0.578489
H  -2.879581 0.040518 1.62872
H  -1.392106 1.988625 1.197415
H  -0.9764 1.570803 -0.469817
H  -1.769828 3.095925 -0.119843
H  -4.465419 0.957168 -1.670968
H  -3.582687 2.465626 -1.835169
H  -2.75858 0.942944 -2.122578
H  -4.130875 3.259845 0.456972
H  -3.878017 2.217963 1.856178
H  -5.143195 1.841156 0.682916
H  0.06252 -2.053084 -0.99047
H  -0.784392 -0.531157 1.383748
H  1.099822 -3.794384 0.451527
H  -0.660616 -3.761957 0.532986
H  0.286226 -3.106599 1.863263
H  2.018313 -1.877615 2.130291
H  3.262061 1.41406 -1.321871
H  4.009463 -0.503716 2.44156
elementType: Cl O N C H
totalener: -1687.68859811 hartree
nucrepener: 1821.74801793 hartree
electener: -3509.43661604 hartree
oneelecener: -5931.90442761 hartree
twoeener: 2422.46781157 hartree
cpcmener: -0.04791523 hartree
kineticenergy: 1682.88016636 hartree
xcener: -117.976024015800 hartree
chargesum: 0.0000000
charge: -0.088295 -0.085497 -0.540514 -0.156320 -0.106433 0.238647 0.209254 -0.359864 -0.341204 -0.324617 0.285252 0.122150 0.043799 -0.294449 -0.287609 -0.054003 -0.126956 -0.103897 -0.170406 0.087588 0.126214 0.114065 0.082825 0.107943 0.104735 0.105677 0.090950 0.101246 0.107291 0.100861 0.091150 0.185701 0.111936 0.105794 0.092223 0.154448 0.124597 0.145717
qa: -0.0883 -0.0855 -0.5405 -0.1563 -0.1064 0.2386 0.2093 -0.3599 -0.3412 -0.3246 0.2853 0.1222 0.0438 -0.2944 -0.2876 -0.0540 -0.1270 -0.1039 -0.1704 0.0876 0.1262 0.1141 0.0828 0.1079 0.1047 0.1057 0.0910 0.1012 0.1073 0.1009 0.0911 0.1857 0.1119 0.1058 0.0922 0.1544 0.1246 0.1457
va: 1.2365 1.2175 1.9508 3.2961 3.1153 3.7462 3.8003 3.9414 3.9537 3.9217 4.2157 3.7514 3.5467 4.1383 3.9669 3.9837 3.9393 4.0390 4.0442 3.8669 1.0276 1.0021 1.0235 1.0085 1.0045 1.0038 1.0150 1.0046 1.0030 1.0084 1.0492 0.9990 1.0026 1.0047 1.0035 0.9933 1.0189 1.0054
dispcorr: -0.021944887 hartree
energy: -1687.710542996261
dipole: -28.42450 31.10064 2.67614 1.90755 -0.70274 1.20481 7.71542 -5.18342 2.53200
magnitude: 3.87612 au
magnitude: 9.85232 debye
