program: Orca
programVersion: 5.0.2
elementType: Cl Cl O N N C C C C C C C C C C C C C C C H H H H H H H H H H H H H H H H H H
charge: 0
multiplicity: 1
keywords: wb97x-d3
keywords: def2-TZVPP
keywords: def2/J RIJCOSX
keywords: DEFGRID2
keywords: scfconv7
keywords: smallprint printgap noloewdin
keywords: NOSOSCF
formula: C15H18Cl2N2O
InChI: InChI=1/C15H18Cl2N2O/c1-9(11-6-5-10(16)7-13(11)17)19-14(20)12(8-18)15(2,3)4/h5-7,9,12,19H,1-4H3
38 atoms
Cl 0.721068 -0.272285 -2.135628
Cl 5.364003 1.327114 -0.022083
O  -2.417584 -1.729185 -0.629904
N  -0.896371 -0.765976 0.739388
N  -5.371645 -1.094559 1.015373
C  -3.298049 1.390271 -0.319262
C  -3.123986 0.174527 0.6461
C  -1.966255 2.130244 -0.414574
C  -3.752196 0.954233 -1.709124
C  -4.3436 2.324664 0.289218
C  -2.104194 -0.867618 0.182071
C  0.180173 -1.719269 0.506748
C  1.483529 -0.963221 0.379166
C  -4.382136 -0.531436 0.842293
C  0.180704 -2.797442 1.579397
C  1.807118 -0.266432 -0.784789
C  2.407247 -0.915742 1.417385
C  2.989754 0.440906 -0.922699
C  3.599826 -0.217496 1.313752
C  3.87987 0.455162 0.138069
H  -2.834549 0.575494 1.623054
H  -1.590684 2.413631 0.570439
H  -1.199061 1.538957 -0.914045
H  -2.097899 3.044491 -0.995012
H  -4.688211 0.393478 -1.679053
H  -3.924078 1.838176 -2.324788
H  -3.006752 0.345098 -2.219567
H  -4.445189 3.217419 -0.329263
H  -4.058423 2.644972 1.293003
H  -5.328811 1.858988 0.350033
H  -0.022877 -2.205913 -0.447378
H  -0.741696 -0.057688 1.443482
H  0.995246 -3.503898 1.420936
H  -0.756387 -3.351318 1.53152
H  0.271257 -2.38305 2.583376
H  2.202347 -1.439747 2.340783
H  3.212833 0.966679 -1.840628
H  4.294823 -0.204592 2.141736
elementType: Cl O N C H
totalener: -1687.68876279 hartree
nucrepener: 1815.50932936 hartree
electener: -3503.19809214 hartree
oneelecener: -5919.54745942 hartree
twoeener: 2416.34936728 hartree
cpcmener: -0.04763478 hartree
kineticenergy: 1682.87293028 hartree
xcener: -117.974788156329 hartree
chargesum: 0.0000000
charge: -0.088620 -0.085898 -0.541553 -0.158489 -0.107371 0.237012 0.217800 -0.356859 -0.343493 -0.326103 0.286319 0.127614 0.030101 -0.295964 -0.294259 -0.046957 -0.118104 -0.116825 -0.168882 0.087919 0.125021 0.112227 0.085132 0.106541 0.104545 0.105229 0.090835 0.101684 0.107492 0.100519 0.096924 0.185246 0.113219 0.106122 0.093843 0.154162 0.126995 0.146879
qa: -0.0886 -0.0859 -0.5416 -0.1585 -0.1074 0.2370 0.2178 -0.3569 -0.3435 -0.3261 0.2863 0.1276 0.0301 -0.2960 -0.2943 -0.0470 -0.1181 -0.1168 -0.1689 0.0879 0.1250 0.1122 0.0851 0.1065 0.1045 0.1052 0.0908 0.1017 0.1075 0.1005 0.0969 0.1852 0.1132 0.1061 0.0938 0.1542 0.1270 0.1469
va: 1.2366 1.2166 1.9483 3.2819 3.1168 3.7462 3.8054 3.9370 3.9544 3.9200 4.2139 3.7399 3.5642 4.1404 3.9770 3.9926 3.9182 4.0478 4.0436 3.8639 1.0282 1.0024 1.0250 1.0074 1.0038 1.0039 1.0153 1.0045 1.0033 1.0082 1.0446 1.0000 1.0022 1.0050 1.0018 0.9937 1.0183 1.0048
dispcorr: -0.021659312 hartree
energy: -1687.710422098150
dipole: -29.94318 32.59141 2.64823 4.59183 -2.73690 1.85493 8.05654 -6.15578 1.90076
magnitude: 3.75057 au
magnitude: 9.53319 debye
