program: Orca
programVersion: 5.0.2
elementType: Cl Cl O N N C C C C C C C C C C C C C C C H H H H H H H H H H H H H H H H H H
charge: 0
multiplicity: 1
keywords: wb97x-d3
keywords: def2-TZVPP
keywords: def2/J RIJCOSX
keywords: DEFGRID2
keywords: scfconv7
keywords: smallprint printgap noloewdin
keywords: NOSOSCF
formula: C15H18Cl2N2O
InChI: InChI=1/C15H18Cl2N2O/c1-9(11-6-5-10(16)7-13(11)17)19-14(20)12(8-18)15(2,3)4/h5-7,9,12,19H,1-4H3
38 atoms
Cl 1.0895 1.868215 1.102811
Cl 4.844277 -0.09468 -2.139381
O  -1.724498 -1.901217 -0.297526
N  -1.018603 -0.44446 1.277526
N  -5.226268 -1.547046 0.636451
C  -3.246329 0.72801 -1.144374
C  -3.148074 -0.031051 0.217392
C  -1.950653 1.506155 -1.362662
C  -3.49075 -0.214667 -2.319634
C  -4.412035 1.710824 -1.03551
C  -1.890304 -0.890769 0.365555
C  0.212338 -1.142115 1.593565
C  1.344995 -0.813503 0.640439
C  -4.306741 -0.885379 0.436357
C  0.587857 -0.919702 3.053164
C  1.816145 0.470153 0.374484
C  1.998663 -1.865288 0.004736
C  2.886919 0.702669 -0.475078
C  3.073566 -1.669626 -0.845733
C  3.508069 -0.376838 -1.078816
H  -3.171861 0.724053 1.00995
H  -2.047141 2.140206 -2.245653
H  -1.718029 2.155674 -0.516687
H  -1.095584 0.849211 -1.532976
H  -4.402541 -0.801706 -2.19256
H  -3.611345 0.370419 -3.23313
H  -2.664837 -0.905305 -2.482398
H  -4.500294 2.292672 -1.954637
H  -4.270351 2.412945 -0.210887
H  -5.36585 1.201283 -0.881708
H  0.008943 -2.207722 1.474753
H  -1.239552 0.392092 1.794795
H  -0.211554 -1.277386 3.703022
H  0.7741 0.127732 3.287248
H  1.489061 -1.482792 3.292615
H  1.655223 -2.876708 0.184276
H  3.230174 1.711742 -0.657862
H  3.556061 -2.5135 -1.319192
elementType: Cl O N C H
totalener: -1687.69699421 hartree
nucrepener: 1826.18737612 hartree
electener: -3513.88437033 hartree
oneelecener: -5941.11290025 hartree
twoeener: 2427.22852992 hartree
cpcmener: -0.03463122 hartree
kineticenergy: 1682.87135009 hartree
xcener: -117.970822877526 hartree
chargesum: -0.0000000
charge: -0.088350 -0.084333 -0.504749 -0.165590 -0.094311 0.214950 0.212120 -0.357128 -0.331890 -0.325335 0.271311 0.066434 0.094577 -0.296322 -0.243734 -0.047147 -0.141988 -0.117746 -0.152179 0.084224 0.111705 0.107451 0.098182 0.101345 0.100185 0.101291 0.100474 0.100564 0.101024 0.103793 0.088218 0.176276 0.109813 0.093480 0.101417 0.144166 0.124114 0.143687
qa: -0.0883 -0.0843 -0.5047 -0.1656 -0.0943 0.2150 0.2121 -0.3571 -0.3319 -0.3253 0.2713 0.0664 0.0946 -0.2963 -0.2437 -0.0471 -0.1420 -0.1177 -0.1522 0.0842 0.1117 0.1075 0.0982 0.1013 0.1002 0.1013 0.1005 0.1006 0.1010 0.1038 0.0882 0.1763 0.1098 0.0935 0.1014 0.1442 0.1241 0.1437
va: 1.2301 1.2182 2.0060 3.2315 3.1223 3.7732 3.7905 3.9396 3.9408 3.9303 4.2488 3.9005 3.4165 4.1260 3.9250 3.9573 3.9667 4.0451 4.0117 3.8736 1.0294 1.0077 1.0093 1.0031 1.0060 1.0037 1.0189 1.0052 1.0038 1.0068 1.0246 1.0111 1.0059 1.0136 1.0047 1.0005 1.0196 1.0050
dispcorr: -0.021900605 hartree
energy: -1687.718894811661
dipole: -29.57281 31.11470 1.54189 1.45103 0.45858 1.90962 0.71111 0.44665 1.15776
magnitude: 2.71376 au
magnitude: 6.89782 debye
