program: Orca
programVersion: 5.0.2
elementType: Cl Cl O N N C C C C C C C C C C C C C C C H H H H H H H H H H H H H H H H H H
charge: 0
multiplicity: 1
keywords: wb97x-d3
keywords: def2-TZVPP
keywords: def2/J RIJCOSX
keywords: DEFGRID2
keywords: scfconv7
keywords: smallprint printgap noloewdin
keywords: NOSOSCF
formula: C15H18Cl2N2O
InChI: InChI=1/C15H18Cl2N2O/c1-9(11-6-5-10(16)7-13(11)17)19-14(20)12(8-18)15(2,3)4/h5-7,9,12,19H,1-4H3
38 atoms
Cl 2.22523 -2.737304 -0.056809
Cl 5.322584 1.584663 -0.520655
O  -2.491045 -1.91103 0.394831
N  -1.041268 -0.196075 0.184536
N  -2.052666 1.704103 -2.425254
C  -4.36562 0.621856 -0.053872
C  -3.236802 -0.052804 -0.902971
C  -5.136634 -0.440131 0.730223
C  -3.772806 1.649442 0.908603
C  -5.335363 1.314122 -1.014692
C  -2.212542 -0.818918 -0.050121
C  -0.000328 -0.811519 0.995763
C  1.341872 -0.245191 0.598136
C  -2.591868 0.925724 -1.771177
C  -0.265354 -0.624321 2.488177
C  2.392569 -1.025405 0.123009
C  1.576802 1.12327 0.719718
C  3.618705 -0.472009 -0.218915
C  2.784062 1.703295 0.377993
C  3.803846 0.892135 -0.091739
H  -3.706407 -0.801966 -1.547998
H  -5.985535 0.030285 1.228911
H  -5.529251 -1.218435 0.074441
H  -4.53251 -0.926751 1.49213
H  -4.571415 2.136282 1.469758
H  -3.100923 1.190097 1.635155
H  -3.223369 2.433203 0.383299
H  -6.161576 1.754184 -0.454694
H  -5.764141 0.606839 -1.727581
H  -4.860896 2.116335 -1.581163
H  -0.020802 -1.879828 0.784495
H  -0.83582 0.673439 -0.280825
H  0.51756 -1.104505 3.074764
H  -1.217529 -1.077307 2.760178
H  -0.293431 0.430741 2.763204
H  0.79101 1.764039 1.103275
H  4.416881 -1.102921 -0.582838
H  2.93233 2.768881 0.479159
totalener: -1687.67196400 hartree
nucrepener: 1784.31821573 hartree
electener: -3471.99017973 hartree
oneelecener: -5857.53781653 hartree
twoeener: 2385.54763680 hartree
kineticenergy: 1682.91146670 hartree
xcener: -117.974130749932 hartree
chargesum: -0.0000000
charge: -0.055998 -0.061117 -0.385200 -0.202194 0.000855 0.160867 0.173108 -0.290869 -0.336088 -0.297164 0.218287 0.142223 0.059966 -0.350870 -0.283121 0.006470 -0.183147 -0.128475 -0.166550 0.086992 0.113558 0.088475 0.093597 0.104878 0.098445 0.089079 0.105324 0.090477 0.096744 0.108090 0.080251 0.159801 0.105608 0.112783 0.079920 0.125517 0.114634 0.124845
qa: -0.0560 -0.0611 -0.3852 -0.2022 0.0009 0.1609 0.1731 -0.2909 -0.3361 -0.2972 0.2183 0.1422 0.0600 -0.3509 -0.2831 0.0065 -0.1831 -0.1285 -0.1665 0.0870 0.1136 0.0885 0.0936 0.1049 0.0984 0.0891 0.1053 0.0905 0.0967 0.1081 0.0803 0.1598 0.1056 0.1128 0.0799 0.1255 0.1146 0.1248
va: 1.2693 1.2427 2.1307 3.2279 3.1103 3.8596 3.7822 3.9425 3.9575 3.9142 4.2792 3.7995 3.5041 4.0460 3.9341 4.0123 3.9912 4.0414 4.1014 3.9450 1.0275 1.0046 1.0096 1.0153 1.0102 1.0097 1.0054 1.0079 1.0067 1.0089 1.0586 1.0319 1.0105 1.0113 1.0033 1.0106 1.0229 1.0129
dispcorr: -0.020892240 hartree
energy: -1687.692856234929
dipole: -49.05956 48.55606 -0.50350 8.72647 -8.20663 0.51984 11.17083 -10.23885 0.93199
magnitude: 1.17998 au
magnitude: 2.99926 debye
