program: Gaussian 09
title: 000005870
version: EM64L-G09RevD.01
frameworkgroup: C1[X(C18H22O2)]
method: RPBEPBE
basis: SDD
operation: Freq
keyword: #pfreq=noraman
keyword: PBEPBE/SDD
title: #p freq=noraman PBEPBE/SDD
converged: YES YES NO NO
title: Mulliken charges:
elementType: O O C C C C C C C C C C C C C C C C C C H H H H H H H H H H H H H H H H H H H H H H
charge: -0.180110 -0.437024 -0.144119 0.300493 -0.086358 -0.168360 -0.520879 -0.549019 -0.488147 -0.508116 0.042140 -0.508374 -0.794987 0.251770 -0.585874 0.319098 -0.347828 -0.582621 -0.410717 0.292981 0.217746 0.235948 0.208321 0.214152 0.226298 0.231178 0.217639 0.223626 0.199981 0.217634 0.217488 0.247584 0.247215 0.235833 0.227316 0.241157 0.222471 0.225093 0.225259 0.223089 0.249579 0.351444
chargesum: 0.00000
title: Mulliken charges with hydrogens summed into heavy atoms:
elementType: O O C C C C C C C C C C C C C C C C C C
charge: -0.180110 -0.085580 0.073626 0.300493 0.149590 0.039962 -0.080429 -0.100202 -0.064540 -0.072994 0.042140 -0.013574 -0.090681 0.251770 -0.138310 0.319098 -0.122569 -0.359532 -0.161138 0.292981
polarizability: 2.54308285e+02 -1.11384376e+00 1.90238666e+02 8.04831265e+00 4.93252745e+00 1.25218840e+02
1716.lowfreq: -11.4863 -8.3009 -5.0166 0.0002 0.0004 0.0006 30.7978 56.3441 79.5280
frequency: 30.6073 56.3259 79.5224 113.6491 127.3859 158.6439 184.3435 208.0278 228.4841 233.4208 236.2704 260.1887 277.7987 297.3772 336.1678 350.4299 362.5041 372.4048 399.1089 435.8093 440.5501 454.4366 479.3193 504.7016 511.2136 544.5651 558.3421 565.2012 577.2712 618.5112 635.6950 698.1013 710.4503 724.7251 779.6830 815.0885 821.5948 827.4562 836.3940 842.9633 862.0727 887.5732 909.6281 926.3962 941.4195 952.0580 973.5222 988.9823 1001.5930 1006.2995 1017.8691 1038.9875 1055.4497 1072.6725 1083.9083 1101.2656 1117.3550 1127.7086 1134.7548 1137.2512 1158.2863 1168.5811 1175.4274 1190.0327 1198.0467 1212.5558 1220.9245 1239.5239 1242.5473 1251.5135 1258.3310 1261.3551 1283.9819 1289.7145 1292.2953 1294.6975 1316.1763 1323.6730 1329.3605 1337.8404 1341.9267 1354.6903 1376.0684 1380.8946 1384.0037 1426.5336 1429.2960 1455.9133 1460.2583 1469.6478 1471.7623 1473.7695 1489.6719 1491.0375 1500.5398 1601.1362 1619.5733 1653.4482 2899.3411 2905.2871 2956.0233 2960.7814 2972.6880 2978.0005 2986.3692 2990.5540 2998.3315 3005.1727 3016.1940 3035.6000 3039.0321 3048.9950 3056.2005 3071.8029 3079.9699 3091.4827 3094.9437 3142.5395 3171.5321 3580.7305
redmass: 4.4467 4.3718 4.4083 3.6289 3.7973 1.9815 3.0381 1.7949 1.7131 2.8221 4.1824 3.3586 2.8225 3.0098 3.0578 1.1186 3.0062 2.8535 3.7634 3.3791 3.0528 4.0339 2.8312 3.5905 3.6202 2.2702 3.0125 3.3433 4.2666 3.7088 3.3373 2.7958 3.7397 4.2966 2.6629 1.8661 1.7032 1.4941 2.0774 1.8557 1.9124 2.2398 3.2861 2.2480 1.6929 1.3723 2.0882 2.0696 1.9897 2.3296 1.9369 1.8961 3.2403 2.3461 2.1619 2.0685 2.2100 1.9526 1.4556 1.6372 1.5014 1.7951 1.4865 1.5734 1.3456 2.0562 1.6898 1.4699 1.6698 1.5812 1.6770 1.7785 1.3612 1.4924 1.4802 1.5096 1.3793 1.3353 1.5291 1.5700 1.4587 1.5527 1.4395 1.6287 2.5424 3.3417 1.0823 1.1224 1.0725 1.0925 1.0885 1.0735 1.0700 1.0683 2.7151 6.5755 6.5918 12.0589 1.0805 1.0800 1.0644 1.0767 1.0689 1.0623 1.0578 1.0402 1.0594 1.0654 1.0940 1.1014 1.0970 1.1022 1.0986 1.1020 1.0993 1.0907 1.0979 1.0876 1.0960 1.0660
irintensity: 0.4169 0.4740 5.0327 0.3903 0.6545 0.4155 0.2074 0.5290 0.4036 3.2885 0.8378 1.8634 2.3616 0.3969 0.8425 141.9323 0.6909 0.2418 0.3531 5.7779 6.9467 23.3826 2.5720 0.2956 0.9990 3.5287 2.7014 6.0466 0.7834 1.9373 5.0477 5.5045 4.1749 2.4576 5.8062 9.4857 17.3918 0.4472 7.5821 11.0860 24.7171 10.5059 25.1485 2.6551 2.2535 0.6226 12.6933 7.9150 19.2582 22.6528 0.9523 9.9039 19.1107 0.6110 16.5610 4.1251 1.1720 54.8152 1.2953 208.4990 2.9045 1.8362 15.6528 13.9774 1.7279 12.8403 6.5246 3.4651 10.3271 10.7527 9.5552 5.2070 2.3736 2.5491 4.4205 3.6355 1.1538 0.4095 6.0761 4.1350 1.2969 1.4819 11.7124 14.3148 6.4992 40.2243 19.5209 9.0397 5.8366 9.1021 6.8094 8.3655 10.2056 10.5420 80.2268 9.8447 66.7057 192.8554 8.4604 25.1530 27.8771 7.4706 41.8528 31.3365 21.2759 26.4141 28.1026 15.1336 38.4188 47.9803 32.8321 49.3596 11.2310 42.1038 18.3306 25.8440 26.2540 11.0091 10.6724 36.6056
temp: 298.150 k
press: 1.00000 atm
elementType: 8 8 6 6 6 6 6 6 6 6 6 6 6 6 6 6 6 6 6 6 1 1 1 1 1 1 1 1 1 1 1 1 1 1 1 1 1 1 1 1 1 1
symmnumber: 1
zpe: 936305.8 jmol-1
zpe.correction: 0.356620 hartree
zpe.thermalcorrener: 0.374072 hartree
zpe.thermalcorrenthalpy: 0.375016 hartree
zpe.thermalcorrgfe: 0.312398 hartree
zpe.sumelectzpe: -848.086498 hartree
zpe.sumelectthermal: -848.069047 hartree
zpe.sumelectthermalent: -848.068103 hartree
zpe.sumelectthermalfe: -848.130721 hartree
dipole: 1.6157 3.9341 0.7062
dipole: 4.3112
quadrupole: -140.1330 -114.1666 -119.0826
quadrupole: -0.8583 -0.8447 0.7905
quadrupole: -15.6723 10.2941 5.3781 -0.8583 -0.8447 0.7905
hfenergy: -848.4431184 hartree
pointgroup: C01 [X(C18H22O2)]
dipole: 0.630811 1.5477428 0.2889936 debye
polarizability: 254.3020812|-0.9809992|190.1610415|8.1252754|5.4041425|125.3026685 unknown
InChI: InChI=1S/C18H22O2/c1-18-9-8-14-13-5-3-12(19)10-11(13)2-4-15(14)16(18)6-7-17(18)20/h3,5,10,14-16,19H,2,4,6-9H2,1H3
charge 0 multiplicity 1
42 atoms
O  -5.00239 -1.270094 -0.323752
O  5.954485 -0.227658 0.313408
C  -2.013469 0.701869 -0.308206
C  -2.663774 -0.602181 0.24839
C  -0.528232 0.810053 0.073339
C  0.220684 -0.423427 -0.52864
C  -1.961509 -1.827256 -0.371248
C  -3.021898 1.820488 0.067991
C  -0.430864 -1.774643 -0.104604
C  0.150537 2.10376 -0.423404
C  -4.14201 -0.379807 -0.123018
C  -4.397904 1.144234 -0.201993
C  -2.654633 -0.694313 1.809781
C  1.733062 -0.348342 -0.256333
C  1.582642 2.202037 0.138327
C  2.370313 0.897779 0.018273
C  2.5495 -1.50972 -0.329805
C  3.773586 0.944945 0.210098
C  3.942932 -1.466902 -0.139069
C  4.557292 -0.225723 0.133489
H  -2.049963 0.612251 -1.420259
H  -0.43266 0.784063 1.180141
H  0.081694 -0.344062 -1.633171
H  -2.145833 -1.835742 -1.464631
H  -2.385016 -2.767574 0.028696
H  -2.88541 2.735258 -0.533964
H  -2.919653 2.108014 1.131241
H  -0.217304 -1.962277 0.966064
H  0.038349 -2.606787 -0.66194
H  -0.429344 2.993951 -0.112997
H  0.173116 2.099992 -1.532605
H  -4.771535 1.371918 -1.219248
H  -5.2006 1.436684 0.498738
H  -1.627995 -0.77978 2.20294
H  -3.125659 0.182501 2.289333
H  -3.216781 -1.592758 2.122038
H  1.526914 2.483844 1.211046
H  2.13793 3.018069 -0.36371
H  2.091627 -2.480404 -0.544614
H  4.251416 1.913437 0.418524
H  4.559486 -2.368347 -0.199298
H  6.28457 0.686349 0.498551
