program: Orca
programVersion: 5.0.2
elementType: Cl Cl Cl O N C C C C C C C C C C C C C C C H H H H H H H H H H H H H H H H H H
charge: 0
multiplicity: 1
keywords: wb97x-d3
keywords: def2-TZVPP
keywords: def2/J RIJCOSX
keywords: DEFGRID2
keywords: scfconv7
keywords: smallprint printgap noloewdin
keywords: NOSOSCF
formula: C15H18Cl3NO
InChI: InChI=1/C15H18Cl3NO/c1-4-14(10(3)15(14,17)18)13(20)19-9(2)11-5-7-12(16)8-6-11/h5-10,19H,4H2,1-3H3
38 atoms
Cl 3.779585 1.570161 -1.561572
Cl 0.916474 1.812607 -1.300094
Cl -5.624161 0.778358 0.636991
O  0.500516 -0.667783 1.679771
N  0.67203 -1.338045 -0.465736
C  2.370072 0.114901 0.408305
C  2.518094 1.514103 0.961062
C  2.399036 1.300458 -0.508618
C  3.57807 -0.807004 0.485865
C  1.078081 -0.640906 0.598368
C  1.480082 2.258548 1.753556
C  3.647976 -1.563159 1.8042
C  -0.500227 -2.197558 -0.448977
C  -1.768546 -1.42556 -0.16168
C  -0.59331 -2.927928 -1.780669
C  -2.629349 -1.844479 0.844226
C  -2.117546 -0.31019 -0.916508
C  -3.819297 -1.176915 1.09681
C  -3.297424 0.374978 -0.674254
C  -4.142083 -0.06884 0.33202
H  3.532123 1.730397 1.28478
H  4.483603 -0.211842 0.371339
H  3.557235 -1.507299 -0.351708
H  1.646273 3.331587 1.65559
H  0.459926 2.048967 1.44456
H  1.568309 2.005935 2.809355
H  4.593517 -2.101515 1.874394
H  3.592885 -0.883681 2.6552
H  2.850554 -2.298789 1.90504
H  1.19855 -1.263595 -1.325005
H  -0.371384 -2.941629 0.342381
H  0.303783 -3.520711 -1.963673
H  -1.446359 -3.60427 -1.776174
H  -0.719545 -2.229968 -2.609459
H  -2.372105 -2.7065 1.447679
H  -1.466663 0.037447 -1.708205
H  -4.477583 -1.516067 1.884929
H  -3.554186 1.242019 -1.267397
elementType: Cl O N C H
totalener: -2093.12497461 hartree
nucrepener: 2028.55600470 hartree
electener: -4121.68097931 hartree
oneelecener: -6909.20862192 hartree
twoeener: 2787.52764260 hartree
cpcmener: -0.03451805 hartree
kineticenergy: 2087.91652546 hartree
xcener: -134.211946762924 hartree
chargesum: -0.0000000
charge: -0.104464 -0.102152 -0.103411 -0.540986 -0.173219 -0.005696 -0.053398 0.139278 -0.078146 0.324898 -0.274076 -0.292863 0.164269 0.084613 -0.282271 -0.203961 -0.257511 -0.140760 -0.164211 0.091962 0.098067 0.065412 0.089208 0.105735 0.063476 0.102378 0.100980 0.093319 0.089641 0.183934 0.094398 0.110450 0.100544 0.101227 0.142809 0.141595 0.144113 0.144820
qa: -0.1045 -0.1022 -0.1034 -0.5410 -0.1732 -0.0057 -0.0534 0.1393 -0.0781 0.3249 -0.2741 -0.2929 0.1643 0.0846 -0.2823 -0.2040 -0.2575 -0.1408 -0.1642 0.0920 0.0981 0.0654 0.0892 0.1057 0.0635 0.1024 0.1010 0.0933 0.0896 0.1839 0.0944 0.1104 0.1005 0.1012 0.1428 0.1416 0.1441 0.1448
va: 1.2069 1.2197 1.2008 1.9546 3.2247 3.7192 3.9111 4.2516 3.8603 4.0309 3.9889 3.9449 3.7962 3.3847 3.9418 4.0265 4.0165 3.9737 4.0226 3.8224 1.0198 1.0193 1.0142 0.9990 1.0183 1.0031 1.0015 0.9999 1.0058 1.0036 1.0131 1.0046 1.0052 0.9975 1.0045 1.0181 1.0049 1.0057
dispcorr: -0.022293200 hartree
energy: -2093.147267810550
dipole: 14.71589 -13.07296 1.64293 -19.66870 18.27766 -1.39104 9.50896 -10.67386 -1.16491
magnitude: 2.44770 au
magnitude: 6.22156 debye
