program: Orca
programVersion: 5.0.2
elementType: Cl Cl Cl O N C C C C C C C C C C C C C C C H H H H H H H H H H H H H H H H H H
charge: 0
multiplicity: 1
keywords: wb97x-d3
keywords: def2-TZVPP
keywords: def2/J RIJCOSX
keywords: DEFGRID2
keywords: scfconv7
keywords: smallprint printgap noloewdin
keywords: NOSOSCF
formula: C15H18Cl3NO
InChI: InChI=1/C15H18Cl3NO/c1-4-14(10(3)15(14,17)18)13(20)19-9(2)11-5-7-12(16)8-6-11/h5-10,19H,4H2,1-3H3
38 atoms
Cl 3.964557 1.732364 -0.796582
Cl 1.111167 1.731071 -1.199421
Cl -5.468723 0.910566 0.738874
O  0.592843 -1.279734 1.683208
N  0.69349 -1.350691 -0.56428
C  2.331901 -0.037338 0.666329
C  2.194354 1.310913 1.340544
C  2.414662 1.231995 -0.130688
C  3.599098 -0.838166 0.926791
C  1.112359 -0.926324 0.628906
C  0.906264 1.825973 1.922337
C  3.995786 -1.764461 -0.212122
C  -0.500596 -2.168048 -0.722251
C  -1.744066 -1.390655 -0.348133
C  -0.568984 -2.682689 -2.151708
C  -2.050806 -0.192464 -0.986932
C  -2.606459 -1.862415 0.632292
C  -3.191417 0.521337 -0.657641
C  -3.758126 -1.165299 0.971916
C  -4.037622 0.024859 0.32275
H  3.072838 1.612051 1.903476
H  3.440777 -1.413871 1.841862
H  4.414828 -0.149137 1.147708
H  0.9146 2.91595 1.933475
H  0.021609 1.505812 1.375224
H  0.801642 1.48561 2.951764
H  3.281665 -2.575384 -0.351703
H  4.083686 -1.227111 -1.156856
H  4.963827 -2.219907 -0.002649
H  1.151502 -1.01333 -1.397998
H  -0.418956 -3.0267 -0.051777
H  -0.626591 -1.863836 -2.870647
H  0.306413 -3.287348 -2.39025
H  -1.452885 -3.305374 -2.28001
H  -1.399332 0.196264 -1.75911
H  -2.382625 -2.790624 1.143888
H  -3.416657 1.451677 -1.1613
H  -4.419733 -1.545914 1.738194
elementType: Cl O N C H
totalener: -2093.12406698 hartree
nucrepener: 2041.07524633 hartree
electener: -4134.19931331 hartree
oneelecener: -6933.93289512 hartree
twoeener: 2799.73358181 hartree
cpcmener: -0.03194426 hartree
kineticenergy: 2087.90717758 hartree
xcener: -134.210532037788 hartree
chargesum: -0.0000000
charge: -0.104919 -0.101803 -0.102934 -0.548655 -0.176825 -0.002790 -0.041742 0.141165 -0.093435 0.314119 -0.273411 -0.283657 0.175545 0.095106 -0.281186 -0.265307 -0.211023 -0.165718 -0.141864 0.093016 0.094005 0.089364 0.072109 0.107826 0.066192 0.102713 0.089857 0.080732 0.103601 0.186004 0.094040 0.098498 0.111042 0.101397 0.144446 0.143798 0.145290 0.145405
qa: -0.1049 -0.1018 -0.1029 -0.5487 -0.1768 -0.0028 -0.0417 0.1412 -0.0934 0.3141 -0.2734 -0.2837 0.1755 0.0951 -0.2812 -0.2653 -0.2110 -0.1657 -0.1419 0.0930 0.0940 0.0894 0.0721 0.1078 0.0662 0.1027 0.0899 0.0807 0.1036 0.1860 0.0940 0.0985 0.1110 0.1014 0.1444 0.1438 0.1453 0.1454
va: 1.2081 1.2178 1.2013 1.9584 3.2219 3.7393 3.8859 4.2257 3.8540 4.0909 3.9990 3.9203 3.7820 3.3795 3.9459 4.0158 4.0337 4.0280 3.9719 3.8251 1.0188 1.0160 1.0202 1.0005 1.0052 1.0057 1.0079 1.0129 1.0033 1.0064 1.0165 0.9979 1.0044 1.0049 1.0094 1.0055 1.0059 1.0044
dispcorr: -0.022978483 hartree
energy: -2093.147045458584
dipole: 12.31273 -11.11303 1.19971 -20.31562 19.49220 -0.82343 2.22568 -3.53861 -1.31293
magnitude: 1.95987 au
magnitude: 4.98160 debye
