program: Orca
programVersion: 5.0.2
elementType: Cl Cl Cl O N C C C C C C C C C C C C C C C H H H H H H H H H H H H H H H H H H
charge: 0
multiplicity: 1
keywords: wb97x-d3
keywords: def2-TZVPP
keywords: def2/J RIJCOSX
keywords: DEFGRID2
keywords: scfconv7
keywords: smallprint printgap noloewdin
keywords: NOSOSCF
formula: C15H18Cl3NO
InChI: InChI=1/C15H18Cl3NO/c1-4-14(10(3)15(14,17)18)13(20)19-9(2)11-5-7-12(16)8-6-11/h5-10,19H,4H2,1-3H3
38 atoms
Cl 3.610791 1.755689 -1.255174
Cl 0.735677 1.59976 -1.00836
Cl -5.315826 1.126298 0.370649
O  0.843924 -1.159171 1.959498
N  0.737475 -1.497167 -0.267623
C  2.417267 0.004677 0.612584
C  2.373743 1.380221 1.240543
C  2.272851 1.232994 -0.238592
C  3.742114 -0.74458 0.642181
C  1.240752 -0.91755 0.827951
C  1.239668 1.90658 2.076505
C  3.946994 -1.726827 -0.501855
C  -0.434397 -2.358536 -0.236228
C  -1.68975 -1.520304 -0.105584
C  -0.435508 -3.255722 -1.463448
C  -2.409487 -1.508918 1.082928
C  -2.117316 -0.703569 -1.149911
C  -3.530019 -0.703781 1.238514
C  -3.23347 0.10553 -1.014467
C  -3.928712 0.101798 0.1862
H  3.345844 1.729055 1.577525
H  3.799341 -1.268681 1.599894
H  4.556304 -0.018426 0.653353
H  1.372612 1.604836 3.115302
H  1.237416 2.997002 2.047564
H  0.258955 1.562848 1.755258
H  4.957735 -2.135525 -0.464844
H  3.257448 -2.569645 -0.45353
H  3.825205 -1.247166 -1.473976
H  1.085567 -1.214956 -1.172329
H  -0.35455 -2.993722 0.64783
H  -0.45987 -2.68421 -2.392827
H  0.456401 -3.883292 -1.477221
H  -1.306111 -3.910385 -1.451431
H  -2.095563 -2.135109 1.909149
H  -1.575942 -0.683454 -2.088004
H  -4.075424 -0.704672 2.172764
H  -3.552018 0.734807 -1.834852
elementType: Cl O N C H
totalener: -2093.13548181 hartree
nucrepener: 2046.78071188 hartree
electener: -4139.91619369 hartree
oneelecener: -6945.30267286 hartree
twoeener: 2805.38647917 hartree
cpcmener: -0.02541904 hartree
kineticenergy: 2087.88987552 hartree
xcener: -134.205610403361 hartree
chargesum: 0.0000000
charge: -0.104248 -0.099671 -0.100972 -0.508443 -0.183499 0.001996 -0.046922 0.143100 -0.097047 0.301472 -0.271905 -0.282406 0.183790 0.081445 -0.283737 -0.207719 -0.266918 -0.142509 -0.144390 0.092303 0.092433 0.092140 0.070692 0.100616 0.104920 0.067358 0.102471 0.087485 0.081272 0.179324 0.091310 0.093385 0.108348 0.102169 0.137036 0.141343 0.141501 0.142477
qa: -0.1042 -0.0997 -0.1010 -0.5084 -0.1835 0.0020 -0.0469 0.1431 -0.0970 0.3015 -0.2719 -0.2824 0.1838 0.0814 -0.2837 -0.2077 -0.2669 -0.1425 -0.1444 0.0923 0.0924 0.0921 0.0707 0.1006 0.1049 0.0674 0.1025 0.0875 0.0813 0.1793 0.0913 0.0934 0.1083 0.1022 0.1370 0.1413 0.1415 0.1425
va: 1.2098 1.2202 1.2037 2.0067 3.2123 3.7300 3.8919 4.2352 3.8594 4.1206 3.9968 3.9211 3.7708 3.4141 3.9505 4.0278 4.0027 3.9896 4.0014 3.8379 1.0197 1.0112 1.0194 1.0053 0.9994 1.0130 1.0051 1.0092 1.0122 1.0078 1.0193 1.0002 1.0033 1.0053 1.0140 1.0104 1.0059 1.0056
dispcorr: -0.022929700 hartree
energy: -2093.158411509755
dipole: 15.22604 -14.04754 1.17850 -21.73801 20.70307 -1.03494 5.01165 -6.06935 -1.05770
magnitude: 1.89174 au
magnitude: 4.80841 debye
