program: Orca
programVersion: 5.0.2
elementType: Cl Cl Cl O N C C C C C C C C C C C C C C C H H H H H H H H H H H H H H H H H H
charge: 0
multiplicity: 1
keywords: wb97x-d3
keywords: def2-TZVPP
keywords: def2/J RIJCOSX
keywords: DEFGRID2
keywords: scfconv7
keywords: smallprint printgap noloewdin
keywords: NOSOSCF
formula: C15H18Cl3NO
InChI: InChI=1/C15H18Cl3NO/c1-4-14(10(3)15(14,17)18)13(20)19-9(2)11-5-7-12(16)8-6-11/h5-10,19H,4H2,1-3H3
38 atoms
Cl 3.569972 1.830146 -1.135857
Cl 0.698021 1.630492 -0.886204
Cl -5.25693 1.160898 0.375766
O  0.83615 -1.286902 1.911504
N  0.748978 -1.503033 -0.332488
C  2.404812 -0.034162 0.63741
C  2.347974 1.303783 1.341292
C  2.242529 1.237386 -0.143782
C  3.737548 -0.769289 0.62248
C  1.238511 -0.981055 0.798275
C  1.210709 1.767205 2.209935
C  3.945356 -1.693522 -0.567965
C  -0.424074 -2.363438 -0.365239
C  -1.675721 -1.524668 -0.206491
C  -0.403862 -3.191656 -1.63991
C  -2.105976 -0.67975 -1.226427
C  -2.381175 -1.531738 0.990717
C  -3.209699 0.140164 -1.059107
C  -3.488174 -0.715184 1.178549
C  -3.8883 0.120516 0.150479
H  3.317173 1.645387 1.693416
H  3.807789 -1.337413 1.553914
H  4.543297 -0.035323 0.662399
H  0.234453 1.422639 1.877304
H  1.355892 1.415262 3.230723
H  1.188433 2.857147 2.236479
H  3.265232 -2.544482 -0.556025
H  3.811796 -1.168701 -1.515023
H  4.960072 -2.092048 -0.556336
H  1.10135 -1.167048 -1.216312
H  -0.359087 -3.045392 0.484378
H  -1.280813 -3.835985 -1.686396
H  -0.39785 -2.569719 -2.536621
H  0.482127 -3.826989 -1.66653
H  -1.576837 -0.646833 -2.170917
H  -2.066169 -2.181315 1.798063
H  -3.531605 0.790517 -1.86147
H  -4.02187 -0.728582 2.119371
elementType: Cl O N C H
totalener: -2093.13521039 hartree
nucrepener: 2050.94409446 hartree
electener: -4144.07930485 hartree
oneelecener: -6953.63383758 hartree
twoeener: 2809.55453273 hartree
cpcmener: -0.02526135 hartree
kineticenergy: 2087.89900831 hartree
xcener: -134.207462093662 hartree
chargesum: -0.0000000
charge: -0.104684 -0.099759 -0.100743 -0.506765 -0.181077 0.002631 -0.047552 0.142830 -0.095971 0.299722 -0.270811 -0.282630 0.182921 0.079941 -0.284189 -0.266985 -0.207196 -0.143502 -0.143854 0.093623 0.092600 0.092243 0.070043 0.066145 0.101065 0.104952 0.087718 0.081233 0.102369 0.178207 0.092060 0.102579 0.092391 0.108525 0.142035 0.136124 0.142393 0.141366
qa: -0.1047 -0.0998 -0.1007 -0.5068 -0.1811 0.0026 -0.0476 0.1428 -0.0960 0.2997 -0.2708 -0.2826 0.1829 0.0799 -0.2842 -0.2670 -0.2072 -0.1435 -0.1439 0.0936 0.0926 0.0922 0.0700 0.0661 0.1011 0.1050 0.0877 0.0812 0.1024 0.1782 0.0921 0.1026 0.0924 0.1085 0.1420 0.1361 0.1424 0.1414
va: 1.2094 1.2206 1.2041 2.0080 3.2111 3.7304 3.8925 4.2349 3.8586 4.1212 3.9973 3.9227 3.7721 3.4177 3.9511 4.0031 4.0247 3.9983 3.9906 3.8377 1.0199 1.0105 1.0197 1.0126 1.0051 0.9993 1.0093 1.0118 1.0053 1.0081 1.0185 1.0051 1.0007 1.0032 1.0091 1.0159 1.0056 1.0060
dispcorr: -0.023046470 hartree
energy: -2093.158256859791
dipole: 15.32329 -14.13333 1.18996 -22.14582 21.16720 -0.97862 3.92741 -5.02862 -1.10121
magnitude: 1.89377 au
magnitude: 4.81358 debye
