program: Orca
programVersion: 5.0.2
elementType: Cl Cl Cl O N C C C C C C C C C C C C C C C H H H H H H H H H H H H H H H H H H
charge: 0
multiplicity: 1
keywords: wb97x-d3
keywords: def2-TZVPP
keywords: def2/J RIJCOSX
keywords: DEFGRID2
keywords: scfconv7
keywords: smallprint printgap noloewdin
keywords: NOSOSCF
formula: C15H18Cl3NO
InChI: InChI=1/C15H18Cl3NO/c1-4-14(10(3)15(14,17)18)13(20)19-9(2)11-5-7-12(16)8-6-11/h5-10,19H,4H2,1-3H3
38 atoms
Cl 3.374429 1.975335 -1.124598
Cl 0.599004 1.669778 -0.368655
Cl -5.255752 1.309667 0.019411
O  1.312513 -1.563183 1.98831
N  0.73244 -1.474516 -0.20029
C  2.570232 -0.115261 0.588584
C  2.651883 1.123762 1.448222
C  2.257671 1.23859 0.014739
C  3.871404 -0.814732 0.224328
C  1.458258 -1.101518 0.875642
C  1.710121 1.435505 2.578979
C  3.842872 -1.566401 -1.099582
C  -0.445713 -2.322108 -0.117046
C  -1.691597 -1.457735 -0.108453
C  -0.40626 -3.372509 -1.216418
C  -2.05637 -0.815207 1.072656
C  -2.454196 -1.226111 -1.245316
C  -3.146646 0.035074 1.120774
C  -3.550177 -0.375319 -1.215013
C  -3.889791 0.251897 -0.029775
H  3.67129 1.447525 1.63962
H  4.109195 -1.499138 1.042481
H  4.675023 -0.077159 0.204643
H  1.742293 2.501918 2.801674
H  0.678721 1.170611 2.362283
H  2.009405 0.888434 3.470991
H  3.581136 -0.904081 -1.925329
H  4.826074 -1.98344 -1.316459
H  3.134172 -2.393208 -1.087528
H  0.840039 -0.938622 -1.046711
H  -0.381909 -2.833307 0.844045
H  -0.350066 -2.929956 -2.212624
H  0.47056 -4.006119 -1.090352
H  -1.291935 -4.006242 -1.18199
H  -1.474705 -0.982593 1.971077
H  -2.209084 -1.71147 -2.181126
H  -3.420319 0.524045 2.045371
H  -4.135356 -0.205285 -2.108004
totalener: -2093.11019982 hartree
nucrepener: 2045.35325416 hartree
electener: -4138.46345398 hartree
oneelecener: -6942.03704800 hartree
twoeener: 2803.57359402 hartree
kineticenergy: 2087.94259551 hartree
xcener: -134.213095155685 hartree
chargesum: 0.0000000
charge: -0.086148 -0.080578 -0.078625 -0.390177 -0.168375 0.019237 -0.086176 0.140548 -0.113963 0.241037 -0.238910 -0.271491 0.126802 0.009261 -0.281922 -0.181943 -0.159450 -0.125619 -0.141141 0.087332 0.078528 0.097067 0.065179 0.097111 0.057400 0.103727 0.079542 0.095560 0.083417 0.146964 0.100082 0.071536 0.100784 0.110908 0.132717 0.118618 0.122152 0.119009
qa: -0.0861 -0.0806 -0.0786 -0.3902 -0.1684 0.0192 -0.0862 0.1405 -0.1140 0.2410 -0.2389 -0.2715 0.1268 0.0093 -0.2819 -0.1819 -0.1594 -0.1256 -0.1411 0.0873 0.0785 0.0971 0.0652 0.0971 0.0574 0.1037 0.0795 0.0956 0.0834 0.1470 0.1001 0.0715 0.1008 0.1109 0.1327 0.1186 0.1222 0.1190
va: 1.2307 1.2403 1.2267 2.1253 3.1470 3.6933 3.9552 4.2337 3.8577 4.1625 3.9954 3.9210 3.7881 3.6529 3.9657 3.9879 4.0114 4.0147 4.0693 3.9301 1.0201 1.0103 1.0214 0.9996 1.0206 1.0068 1.0157 1.0096 1.0103 1.0374 1.0334 1.0031 1.0087 1.0043 1.0217 1.0043 1.0123 1.0143
dispcorr: -0.022960167 hartree
energy: -2093.133159986298
dipole: 16.77452 -16.15714 0.61738 -23.61969 23.03848 -0.58121 3.57164 -4.13356 -0.56192
magnitude: 1.01721 au
magnitude: 2.58555 debye
