program: Orca
programVersion: 5.0.2
elementType: Cl Cl Cl O N C C C C C C C C C C C C C C C H H H H H H H H H H H H H H H H H H
charge: 0
multiplicity: 1
keywords: wb97x-d3
keywords: def2-TZVPP
keywords: def2/J RIJCOSX
keywords: DEFGRID2
keywords: scfconv7
keywords: smallprint printgap noloewdin
keywords: NOSOSCF
formula: C15H18Cl3NO
InChI: InChI=1/C15H18Cl3NO/c1-4-14(10(3)15(14,17)18)13(20)19-9(2)11-5-7-12(16)8-6-11/h5-10,19H,4H2,1-3H3
38 atoms
Cl 3.509864 1.803736 -1.268179
Cl 0.650493 1.486027 -0.972913
Cl -5.132465 1.284914 0.392141
O  1.030418 -1.361306 1.945396
N  0.78629 -1.594409 -0.290018
C  2.453573 -0.053341 0.571525
C  2.349936 1.299163 1.236379
C  2.22032 1.186967 -0.244684
C  3.814694 -0.731532 0.545817
C  1.333861 -1.042309 0.815611
C  1.207194 1.719386 2.120266
C  4.034956 -1.659939 -0.640378
C  -0.414086 -2.414186 -0.226632
C  -1.639432 -1.531889 -0.093681
C  -0.454114 -3.352554 -1.423146
C  -2.216648 -0.912211 -1.196963
C  -2.168658 -1.264261 1.164183
C  -3.291381 -0.050098 -1.057272
C  -3.243875 -0.403447 1.322191
C  -3.798373 0.202366 0.207474
H  3.308374 1.698971 1.555957
H  3.917827 -1.28326 1.483404
H  4.592345 0.033532 0.558228
H  1.150714 2.807339 2.157695
H  0.243163 1.344786 1.785633
H  1.368489 1.349157 3.131174
H  3.918365 -1.12814 -1.585068
H  5.045713 -2.066701 -0.618448
H  3.344276 -2.502171 -0.636041
H  0.989955 -1.161718 -1.17669
H  -0.331205 -3.019489 0.676864
H  -0.458975 -2.816494 -2.374006
H  0.416745 -4.007289 -1.419268
H  -1.349076 -3.972053 -1.392371
H  -1.833411 -1.095106 -2.193207
H  -1.726635 -1.723339 2.038783
H  -3.73064 0.423039 -1.924598
H  -3.644288 -0.203788 2.30651
totalener: -2093.11042286 hartree
nucrepener: 2056.75729501 hartree
electener: -4149.86771788 hartree
oneelecener: -6964.95647416 hartree
twoeener: 2815.08875628 hartree
kineticenergy: 2087.94582160 hartree
xcener: -134.212743593815 hartree
chargesum: 0.0000000
charge: -0.087118 -0.084473 -0.079398 -0.389450 -0.181110 0.018291 -0.082195 0.142275 -0.115568 0.248455 -0.240309 -0.271140 0.128165 0.072960 -0.267496 -0.230919 -0.166167 -0.125661 -0.131337 0.089596 0.078079 0.096947 0.064389 0.097080 0.063721 0.102095 0.078637 0.094835 0.084705 0.145191 0.089432 0.072035 0.102816 0.104832 0.113921 0.122446 0.119587 0.121849
qa: -0.0871 -0.0845 -0.0794 -0.3895 -0.1811 0.0183 -0.0822 0.1423 -0.1156 0.2485 -0.2403 -0.2711 0.1282 0.0730 -0.2675 -0.2309 -0.1662 -0.1257 -0.1313 0.0896 0.0781 0.0969 0.0644 0.0971 0.0637 0.1021 0.0786 0.0948 0.0847 0.1452 0.0894 0.0720 0.1028 0.1048 0.1139 0.1224 0.1196 0.1218
va: 1.2297 1.2393 1.2266 2.1261 3.1488 3.6971 3.9540 4.2286 3.8598 4.1563 4.0028 3.9175 3.8513 3.4926 3.9573 4.0286 4.0201 4.0484 4.0123 3.9321 1.0200 1.0111 1.0218 0.9994 1.0136 1.0063 1.0162 1.0091 1.0128 1.0406 1.0206 1.0051 1.0064 1.0062 1.0096 1.0267 1.0128 1.0118
dispcorr: -0.023220904 hartree
energy: -2093.133643769422
dipole: 15.19565 -14.54183 0.65382 -22.12905 21.49727 -0.63179 4.69245 -5.21054 -0.51810
magnitude: 1.04645 au
magnitude: 2.65987 debye
