program: Orca
programVersion: 5.0.2
elementType: Cl Cl S S F O O N N C C C C C C C C C C H H H H H H H H H H H H H
charge: 0
multiplicity: 1
keywords: wb97x-d3
keywords: def2-TZVPP
keywords: def2/J RIJCOSX
keywords: DEFGRID2
keywords: scfconv7
keywords: smallprint printgap noloewdin
keywords: NOSOSCF
formula: C10H13Cl2FN2O2S2
InChI: InChI=1/C10H13Cl2FN2O2S2/c1-8-4-6-9(7-5-8)15(18-10(11,12)13)19(16,17)14(2)3/h4-7H,1-3H3
32 atoms
Cl 3.634282 -1.929506 -0.053341
Cl 2.314564 0.025691 -1.74861
S  -0.000223 1.918594 0.721752
S  1.398602 -0.599465 1.028381
F  1.328386 -2.174087 -1.062342
O  1.347426 2.357539 0.44405
O  -0.580701 2.182356 2.022807
N  0.032266 0.223191 0.483331
N  -1.011037 2.49599 -0.405872
C  -1.230964 -0.449106 0.471278
C  -1.950802 -0.653802 1.642592
C  -1.738245 -0.895016 -0.740351
C  -3.707242 -1.743788 0.38069
C  -2.448407 2.55426 -0.171651
C  -0.605937 2.450715 -1.802501
C  -3.176737 -1.295157 1.589964
C  -2.96828 -1.533952 -0.780639
C  -5.022115 -2.461072 0.343264
C  2.093041 -1.208913 -0.525301
H  -1.557374 -0.321919 2.594569
H  -1.176989 -0.738552 -1.65232
H  -2.828385 3.45735 -0.64892
H  -2.67588 2.61939 0.887377
H  -2.965995 1.692014 -0.595408
H  0.461464 2.618606 -1.910412
H  -1.118458 3.259877 -2.320846
H  -0.875609 1.508315 -2.282126
H  -3.731001 -1.449462 2.508049
H  -3.356493 -1.874821 -1.732859
H  -5.740114 -2.018549 1.033981
H  -5.459967 -2.448306 -0.654231
H  -4.902164 -3.507267 0.633365
elementType: Cl S F O N C H
totalener: -2465.56900383 hartree
nucrepener: 2283.82137236 hartree
electener: -4749.39037619 hartree
oneelecener: -7940.77992425 hartree
twoeener: 3191.38954806 hartree
cpcmener: -0.02265616 hartree
kineticenergy: 2459.58588701 hartree
xcener: -149.990968721474 hartree
chargesum: 0.0000000
charge: -0.040452 -0.038122 0.839704 0.077351 -0.143445 -0.495279 -0.502630 -0.168021 -0.144975 0.110817 -0.190169 -0.235969 -0.007581 -0.178765 -0.189838 -0.121014 -0.134814 -0.202525 0.191683 0.140179 0.136814 0.123703 0.126362 0.107875 0.116377 0.121739 0.114912 0.143573 0.142254 0.099716 0.094619 0.105922
qa: -0.0405 -0.0381 0.8397 0.0774 -0.1434 -0.4953 -0.5026 -0.1680 -0.1450 0.1108 -0.1902 -0.2360 -0.0076 -0.1788 -0.1898 -0.1210 -0.1348 -0.2025 0.1917 0.1402 0.1368 0.1237 0.1264 0.1079 0.1164 0.1217 0.1149 0.1436 0.1423 0.0997 0.0946 0.1059
va: 1.2580 1.2627 6.0407 2.3860 1.1316 1.9946 1.9755 2.8942 3.0501 3.5997 4.0852 4.0528 3.7529 3.8951 3.9095 3.9082 3.9352 3.8983 4.5037 1.0231 1.0270 0.9953 1.0092 0.9820 1.0080 0.9974 0.9860 0.9986 1.0003 0.9996 1.0033 0.9940
dispcorr: -0.020119079 hartree
energy: -2465.589122907933
dipole: -42.80818 40.06947 -2.73871 7.62859 -8.31216 -0.68357 -0.82323 -0.78541 -1.60864
magnitude: 3.24893 au
magnitude: 8.25811 debye
