program: Orca
programVersion: 5.0.2
elementType: Cl Cl S S F O O N N C C C C C C C C C C H H H H H H H H H H H H H
charge: 0
multiplicity: 1
keywords: wb97x-d3
keywords: def2-TZVPP
keywords: def2/J RIJCOSX
keywords: DEFGRID2
keywords: scfconv7
keywords: smallprint printgap noloewdin
keywords: NOSOSCF
formula: C10H13Cl2FN2O2S2
InChI: InChI=1/C10H13Cl2FN2O2S2/c1-8-4-6-9(7-5-8)15(18-10(11,12)13)19(16,17)14(2)3/h4-7H,1-3H3
32 atoms
Cl 3.596775 -1.981477 0.279422
Cl 2.492586 -0.231373 -1.763847
S  0.081998 1.936838 -0.259684
S  1.381603 -0.375347 0.997291
F  1.331281 -2.245881 -0.829878
O  -0.287284 1.970194 -1.656748
O  1.371472 2.428455 0.165067
N  0.047178 0.312871 0.263715
N  -1.084143 2.707124 0.578871
C  -1.17942 -0.41161 0.15024
C  -1.892105 -0.742687 1.295363
C  -1.663335 -0.785429 -1.097391
C  -3.602463 -1.796562 -0.053585
C  -0.927075 2.768083 2.024393
C  -2.463873 2.679899 0.108365
C  -3.087651 -1.434747 1.189765
C  -2.870016 -1.460284 -1.190581
C  -4.891612 -2.551646 -0.168794
C  2.13134 -1.262439 -0.389528
H  -1.51397 -0.463265 2.271171
H  -1.104217 -0.554644 -1.993747
H  -1.297942 1.868888 2.521916
H  -1.496808 3.621792 2.388262
H  0.111838 2.926971 2.302311
H  -2.946452 3.594833 0.450026
H  -3.02022 1.826632 0.50067
H  -2.510715 2.668159 -0.975897
H  -3.631949 -1.689915 2.091276
H  -3.243371 -1.737874 -2.169383
H  -5.513042 -2.161459 -0.975468
H  -4.709361 -3.60615 -0.387329
H  -5.469198 -2.504383 0.75368
elementType: Cl S F O N C H
totalener: -2465.57038515 hartree
nucrepener: 2286.76777729 hartree
electener: -4752.33816244 hartree
oneelecener: -7946.98319937 hartree
twoeener: 3194.64503692 hartree
cpcmener: -0.02307309 hartree
kineticenergy: 2459.59660003 hartree
xcener: -149.995254553185 hartree
chargesum: 0.0000000
charge: -0.040463 -0.039692 0.837627 0.083148 -0.142188 -0.498295 -0.492179 -0.145791 -0.148422 0.093352 -0.234982 -0.200537 -0.013254 -0.197611 -0.182125 -0.124430 -0.120285 -0.203130 0.190479 0.143491 0.134597 0.114674 0.119230 0.124189 0.122664 0.106890 0.126562 0.143333 0.143398 0.100991 0.105442 0.093315
qa: -0.0405 -0.0397 0.8376 0.0831 -0.1422 -0.4983 -0.4922 -0.1458 -0.1484 0.0934 -0.2350 -0.2005 -0.0133 -0.1976 -0.1821 -0.1244 -0.1203 -0.2031 0.1905 0.1435 0.1346 0.1147 0.1192 0.1242 0.1227 0.1069 0.1266 0.1433 0.1434 0.1010 0.1054 0.0933
va: 1.2591 1.2690 6.0330 2.3839 1.1345 1.9797 1.9935 2.9153 3.0456 3.5988 4.0824 4.0592 3.7557 3.9106 3.8982 3.9273 3.9223 3.8988 4.5065 1.0121 1.0333 0.9880 0.9948 1.0080 0.9944 0.9824 1.0104 0.9999 0.9987 0.9986 0.9942 1.0039
dispcorr: -0.019676170 hartree
energy: -2465.590061320745
dipole: -43.75193 40.86115 -2.89078 9.00269 -9.48955 -0.48686 9.76049 -8.09953 1.66095
magnitude: 3.36934 au
magnitude: 8.56417 debye
