program: Orca
programVersion: 5.0.2
elementType: Cl Cl S S F O O N N C C C C C C C C C C H H H H H H H H H H H H H
charge: 0
multiplicity: 1
keywords: wb97x-d3
keywords: def2-TZVPP
keywords: def2/J RIJCOSX
keywords: DEFGRID2
keywords: scfconv7
keywords: smallprint printgap noloewdin
keywords: NOSOSCF
formula: C10H13Cl2FN2O2S2
InChI: InChI=1/C10H13Cl2FN2O2S2/c1-8-4-6-9(7-5-8)15(18-10(11,12)13)19(16,17)14(2)3/h4-7H,1-3H3
32 atoms
Cl 3.452907 -1.672886 0.556265
Cl 2.460278 0.219903 -1.399557
S  -0.656108 1.857623 0.635635
S  0.996516 -0.415415 1.13332
F  1.402857 -1.996012 -0.89983
O  -0.675592 1.978648 2.076669
O  -1.806633 2.168659 -0.173803
N  -0.310783 0.218848 0.263843
N  0.658362 2.632567 0.073562
C  -1.434609 -0.632555 0.018687
C  -1.677019 -1.048975 -1.279839
C  -2.264973 -1.050248 1.047744
C  -3.578612 -2.335735 -0.524456
C  0.662226 3.06968 -1.308881
C  1.630506 3.234974 0.963422
C  -2.740975 -1.893701 -1.544533
C  -3.325964 -1.89562 0.772048
C  -4.703468 -3.285568 -0.81273
C  2.015805 -1.013867 -0.226695
H  -1.029848 -0.710124 -2.077626
H  -2.082956 -0.716795 2.06183
H  1.695856 3.133526 -1.646081
H  0.19374 4.048852 -1.429605
H  0.149321 2.357812 -1.950063
H  2.631073 3.034611 0.578685
H  1.56071 2.811778 1.959392
H  1.489898 4.316005 1.035896
H  -2.92162 -2.215697 -2.562995
H  -3.96985 -2.217506 1.581344
H  -5.175874 -3.070405 -1.77082
H  -4.342639 -4.31528 -0.853661
H  -5.474009 -3.241465 -0.044205
totalener: -2465.54722390 hartree
nucrepener: 2280.47109356 hartree
electener: -4746.01831747 hartree
oneelecener: -7933.57349232 hartree
twoeener: 3187.55517485 hartree
kineticenergy: 2459.63242754 hartree
xcener: -149.992865097744 hartree
chargesum: 0.0000000
charge: -0.040204 -0.052557 0.823431 0.070026 -0.131776 -0.456453 -0.433730 -0.187276 -0.184860 0.125176 -0.186245 -0.170141 -0.000612 -0.206433 -0.163013 -0.095310 -0.094501 -0.206440 0.204386 0.100886 0.120305 0.091569 0.130047 0.122804 0.093422 0.120016 0.109118 0.111165 0.111593 0.089937 0.101007 0.084661
qa: -0.0402 -0.0526 0.8234 0.0700 -0.1318 -0.4565 -0.4337 -0.1873 -0.1849 0.1252 -0.1862 -0.1701 -0.0006 -0.2064 -0.1630 -0.0953 -0.0945 -0.2064 0.2044 0.1009 0.1203 0.0916 0.1300 0.1228 0.0934 0.1200 0.1091 0.1112 0.1116 0.0899 0.1010 0.0847
va: 1.2576 1.2485 6.0195 2.4004 1.1540 2.0225 2.0576 2.9234 3.0022 3.7319 4.1597 4.1704 3.7971 3.9389 3.9023 3.9697 3.9604 3.9090 4.4951 1.0338 1.0259 0.9878 1.0006 0.9997 0.9944 1.0133 0.9920 1.0067 1.0082 1.0022 0.9925 1.0058
dispcorr: -0.019088968 hartree
energy: -2465.566312870075
dipole: -25.73039 26.25018 0.51979 7.24511 -7.31842 -0.07330 -2.97942 2.34407 -0.63535
magnitude: 0.82416 au
magnitude: 2.09484 debye
