program: Orca
programVersion: 5.0.2
elementType: S S O O O O N C C C C C C C C C H H H H H H H H H H H
charge: 0
multiplicity: 1
keywords: wb97x-d3
keywords: def2-TZVPP
keywords: def2/J RIJCOSX
keywords: DEFGRID2
keywords: scfconv7
keywords: smallprint printgap noloewdin
keywords: NOSOSCF
formula: C9H11NO4S2
InChI: InChI=1/C9H11NO4S2/c1-10-9(11)15-8-5-3-7(4-6-8)14-16(2,12)13/h3-6,10H,1-2H3
27 atoms
S  3.39578 -0.43236 -0.751534
S  -3.089182 0.748501 1.274928
O  2.72585 -0.16064 0.715437
O  2.490887 -1.264772 -1.51985
O  3.805323 0.844634 -1.300999
O  -5.097248 0.083572 -0.183959
N  -3.124746 -0.595222 -1.061001
C  1.353688 0.047696 0.776483
C  -1.358147 0.453692 1.038817
C  0.57577 -0.942631 1.35118
C  0.804111 1.236154 0.324184
C  -0.78503 -0.729367 1.496427
C  -0.561276 1.434654 0.456698
C  4.804147 -1.350214 -0.223967
C  -3.88096 0.000377 -0.144828
C  -3.713856 -1.228624 -2.222237
H  1.028658 -1.86026 1.701873
H  1.424296 2.011437 -0.105453
H  -1.398762 -1.489147 1.961265
H  -1.001477 2.359408 0.108771
H  5.378339 -1.593317 -1.117853
H  5.409841 -0.743032 0.445201
H  4.483009 -2.265492 0.267836
H  -2.121987 -0.607643 -0.963781
H  -2.921041 -1.72248 -2.775544
H  -4.192107 -0.503564 -2.88073
H  -4.449251 -1.979295 -1.935243
elementType: S O N C H
totalener: -1501.73907569 hartree
nucrepener: 1360.75702211 hartree
electener: -2862.49609780 hartree
oneelecener: -4765.97522373 hartree
twoeener: 1903.47912593 hartree
cpcmener: -0.04632577 hartree
kineticenergy: 1497.22987295 hartree
xcener: -103.603556865931 hartree
chargesum: -0.0000000
charge: 0.872220 -0.047428 -0.315078 -0.508215 -0.507583 -0.536974 -0.196763 0.216807 -0.025332 -0.159318 -0.133398 -0.103878 -0.115725 -0.205574 0.338355 -0.162997 0.158684 0.162350 0.146974 0.143535 0.145353 0.147531 0.143687 0.201303 0.116033 0.114608 0.110824
qa: 0.8722 -0.0474 -0.3151 -0.5082 -0.5076 -0.5370 -0.1968 0.2168 -0.0253 -0.1593 -0.1334 -0.1039 -0.1157 -0.2056 0.3384 -0.1630 0.1587 0.1623 0.1470 0.1435 0.1454 0.1475 0.1437 0.2013 0.1160 0.1146 0.1108
va: 5.7558 2.3689 2.0285 1.9560 1.9673 1.9574 3.2028 3.7257 3.7954 4.0286 4.0335 3.9428 3.9949 3.8661 4.2770 3.9004 0.9964 1.0024 1.0012 1.0066 1.0051 1.0065 1.0068 0.9917 0.9985 0.9893 0.9927
dispcorr: -0.011858167 hartree
energy: -1501.750933859361
dipole: 1.67532 1.77440 3.44972 -6.80479 5.06847 -1.73632 -4.79279 5.15961 0.36681
magnitude: 3.87943 au
magnitude: 9.86072 debye
