program: Orca
programVersion: 5.0.2
elementType: S S O O O O N C C C C C C C C C H H H H H H H H H H H
charge: 0
multiplicity: 1
keywords: wb97x-d3
keywords: def2-TZVPP
keywords: def2/J RIJCOSX
keywords: DEFGRID2
keywords: scfconv7
keywords: smallprint printgap noloewdin
keywords: NOSOSCF
formula: C9H11NO4S2
InChI: InChI=1/C9H11NO4S2/c1-10-9(11)15-8-5-3-7(4-6-8)14-16(2,12)13/h3-6,10H,1-2H3
27 atoms
S  3.565166 -0.195996 -0.607792
S  -3.046248 0.903399 0.955949
O  2.76859 -0.126551 0.820824
O  2.639896 -0.672818 -1.613772
O  4.238651 1.069722 -0.797174
O  -2.975285 -0.951656 -0.958333
N  -5.013683 -0.139672 -0.417426
C  1.405006 0.117522 0.792496
C  -1.316452 0.564195 0.848072
C  0.56138 -0.886097 1.238607
C  0.912259 1.340298 0.368876
C  -0.802532 -0.652585 1.285234
C  -0.457438 1.555585 0.389156
C  4.747261 -1.437912 -0.197421
C  -3.686539 -0.218555 -0.308604
C  -5.748991 -0.969281 -1.347396
H  0.967078 -1.834622 1.56554
H  1.576005 2.127679 0.034959
H  -1.461668 -1.423452 1.661366
H  -0.850847 2.503475 0.046731
H  4.241138 -2.380426 -0.001107
H  5.409837 -1.544488 -1.056382
H  5.326193 -1.123513 0.668699
H  -5.535416 0.498734 0.162983
H  -6.804047 -0.726769 -1.256952
H  -5.622262 -2.029695 -1.127999
H  -5.444067 -0.787285 -2.377806
elementType: S O N C H
totalener: -1501.73742134 hartree
nucrepener: 1348.26299033 hartree
electener: -2850.00041167 hartree
oneelecener: -4742.87314441 hartree
twoeener: 1892.87273274 hartree
cpcmener: -0.03891638 hartree
kineticenergy: 1497.24542125 hartree
xcener: -103.603020868558 hartree
chargesum: 0.0000000
charge: 0.861466 -0.086930 -0.318555 -0.491217 -0.494102 -0.483718 -0.182874 0.205019 0.060547 -0.149238 -0.129628 -0.144682 -0.125318 -0.213878 0.317902 -0.157663 0.151910 0.153365 0.145668 0.139545 0.140986 0.143312 0.145254 0.172848 0.114124 0.112944 0.112913
qa: 0.8615 -0.0869 -0.3186 -0.4912 -0.4941 -0.4837 -0.1829 0.2050 0.0605 -0.1492 -0.1296 -0.1447 -0.1253 -0.2139 0.3179 -0.1577 0.1519 0.1534 0.1457 0.1395 0.1410 0.1433 0.1453 0.1728 0.1141 0.1129 0.1129
va: 5.7755 2.3358 2.0293 1.9741 1.9844 2.0294 3.1910 3.7495 3.7531 4.0169 4.0267 3.9832 3.9958 3.8765 4.2944 3.8964 0.9985 1.0064 0.9986 1.0080 1.0071 1.0051 1.0068 1.0085 0.9973 0.9912 0.9916
dispcorr: -0.011186365 hartree
energy: -1501.748607703513
dipole: -7.32726 6.38787 -0.93940 -6.17814 5.33310 -0.84505 -1.61475 3.02067 1.40593
magnitude: 1.89029 au
magnitude: 4.80474 debye
