program: Orca
programVersion: 5.0.2
elementType: S S O O O O N C C C C C C C C C H H H H H H H H H H H
charge: 0
multiplicity: 1
keywords: wb97x-d3
keywords: def2-TZVPP
keywords: def2/J RIJCOSX
keywords: DEFGRID2
keywords: scfconv7
keywords: smallprint printgap noloewdin
keywords: NOSOSCF
formula: C9H11NO4S2
InChI: InChI=1/C9H11NO4S2/c1-10-9(11)15-8-5-3-7(4-6-8)14-16(2,12)13/h3-6,10H,1-2H3
27 atoms
S  3.343818 0.379236 0.934479
S  -2.982425 -0.812839 -1.412324
O  2.805738 -0.632137 -0.231327
O  3.077855 1.740928 0.521834
O  2.825304 -0.07676 2.206243
O  -5.01473 0.141538 -0.154305
N  -3.054176 0.629989 0.865288
C  1.441615 -0.637595 -0.471032
C  -1.257373 -0.725723 -1.014338
C  0.660127 -1.5986 0.148804
C  0.901727 0.282645 -1.354608
C  -0.694242 -1.649262 -0.137454
C  -0.456442 0.234039 -1.625644
C  5.059525 0.008113 0.78357
C  -3.802515 0.088286 -0.093034
C  -3.648544 1.383265 1.947597
H  1.105722 -2.314999 0.826185
H  1.530535 1.015796 -1.84156
H  -1.311598 -2.40641 0.327675
H  -0.890275 0.947154 -2.314073
H  5.403021 0.255731 -0.218468
H  5.584186 0.625607 1.512114
H  5.232365 -1.043268 1.002606
H  -2.049206 0.595664 0.805954
H  -4.428994 0.809634 2.445228
H  -4.075112 2.325938 1.603021
H  -2.87251 1.602608 2.674942
elementType: S O N C H
totalener: -1501.73856887 hartree
nucrepener: 1363.87988663 hartree
electener: -2865.61845551 hartree
oneelecener: -4772.27463129 hartree
twoeener: 1906.65617578 hartree
cpcmener: -0.03724488 hartree
kineticenergy: 1497.25997816 hartree
xcener: -103.606149032525 hartree
chargesum: -0.0000000
charge: 0.873651 -0.047571 -0.315085 -0.495972 -0.496649 -0.498594 -0.201505 0.245906 -0.029134 -0.163398 -0.160385 -0.113473 -0.105052 -0.218870 0.322802 -0.160777 0.155281 0.155966 0.146794 0.142150 0.144383 0.142086 0.144914 0.196070 0.109409 0.113584 0.113470
qa: 0.8737 -0.0476 -0.3151 -0.4960 -0.4966 -0.4986 -0.2015 0.2459 -0.0291 -0.1634 -0.1604 -0.1135 -0.1051 -0.2189 0.3228 -0.1608 0.1553 0.1560 0.1468 0.1422 0.1444 0.1421 0.1449 0.1961 0.1094 0.1136 0.1135
va: 5.7777 2.3640 2.0222 1.9813 1.9817 2.0058 3.1871 3.7354 3.8092 4.0475 4.0410 3.9470 3.9583 3.8630 4.2995 3.9038 1.0007 1.0023 1.0013 1.0076 1.0072 1.0067 1.0068 0.9942 0.9948 0.9890 0.9984
dispcorr: -0.011899896 hartree
energy: -1501.750468770576
dipole: 2.67692 0.99971 3.67663 2.90128 -3.20530 -0.30402 5.69064 -5.34503 0.34561
magnitude: 3.70533 au
magnitude: 9.41821 debye
