program: Orca
programVersion: 5.0.2
elementType: S S O O O O N C C C C C C C C C H H H H H H H H H H H
charge: 0
multiplicity: 1
keywords: wb97x-d3
keywords: def2-TZVPP
keywords: def2/J RIJCOSX
keywords: DEFGRID2
keywords: scfconv7
keywords: smallprint printgap noloewdin
keywords: NOSOSCF
formula: C9H11NO4S2
InChI: InChI=1/C9H11NO4S2/c1-10-9(11)15-8-5-3-7(4-6-8)14-16(2,12)13/h3-6,10H,1-2H3
27 atoms
S  3.595424 -0.609629 -0.283435
S  -3.057101 1.249034 -0.126484
O  2.805904 0.693121 0.296185
O  3.242726 -0.797946 -1.673501
O  4.965126 -0.35108 0.089373
O  -2.787669 -1.394384 -0.006825
N  -4.906842 -0.594301 -0.184635
C  1.430541 0.78531 0.162358
C  -1.30729 1.038942 -0.013883
C  0.863879 1.136175 -1.051179
C  0.654732 0.571914 1.291499
C  -0.515427 1.257057 -1.13425
C  -0.719398 0.710552 1.202938
C  2.938971 -1.940097 0.67853
C  -3.57895 -0.483167 -0.100289
C  -5.605851 -1.859867 -0.187142
H  1.479218 1.328249 -1.919234
H  1.120857 0.315896 2.234347
H  -0.969727 1.521448 -2.079688
H  -1.329218 0.562812 2.084132
H  3.468186 -2.843605 0.375157
H  3.1148 -1.750907 1.734909
H  1.876691 -2.064173 0.479203
H  -5.469187 0.237045 -0.287299
H  -4.936434 -2.659802 0.114881
H  -5.999568 -2.092243 -1.177297
H  -6.435773 -1.824526 0.51682
elementType: S O N C H
totalener: -1501.73857188 hartree
nucrepener: 1354.26753422 hartree
electener: -2856.00610609 hartree
oneelecener: -4754.00036653 hartree
twoeener: 1897.99426044 hartree
cpcmener: -0.03716228 hartree
kineticenergy: 1497.25273334 hartree
xcener: -103.607178702983 hartree
chargesum: -0.0000000
charge: 0.870599 -0.098785 -0.305483 -0.489334 -0.497197 -0.485631 -0.173712 0.182620 0.075733 -0.132094 -0.139735 -0.127180 -0.145377 -0.249795 0.304439 -0.139305 0.152419 0.159826 0.139838 0.144127 0.158146 0.145647 0.147837 0.170191 0.104565 0.113234 0.114406
qa: 0.8706 -0.0988 -0.3055 -0.4893 -0.4972 -0.4856 -0.1737 0.1826 0.0757 -0.1321 -0.1397 -0.1272 -0.1454 -0.2498 0.3044 -0.1393 0.1524 0.1598 0.1398 0.1441 0.1581 0.1456 0.1478 0.1702 0.1046 0.1132 0.1144
va: 5.8123 2.3209 2.0381 1.9780 1.9925 2.0276 3.2018 3.7788 3.7247 4.0017 3.9661 3.9912 3.9953 3.8721 4.3064 3.8679 1.0047 0.9930 1.0073 0.9999 1.0052 1.0061 0.9999 1.0074 1.0168 0.9911 0.9938
dispcorr: -0.011680301 hartree
energy: -1501.750252176476
dipole: -12.96523 9.75848 -3.20676 -8.26545 7.76290 -0.50254 2.89400 -1.73268 1.16132
magnitude: 3.44739 au
magnitude: 8.76257 debye
