program: Orca
programVersion: 5.0.2
elementType: Cl Cl S S F O O N N C C C C C C C C C H H H H H H H H H H H
charge: 0
multiplicity: 1
keywords: wb97x-d3
keywords: def2-TZVPP
keywords: def2/J RIJCOSX
keywords: DEFGRID2
keywords: scfconv7
keywords: smallprint printgap noloewdin
keywords: NOSOSCF
formula: C9H11Cl2FN2O2S2
InChI: InChI=1/C9H11Cl2FN2O2S2/c1-13(2)18(15,16)14(17-9(10,11)12)8-6-4-3-5-7-8/h3-7H,1-2H3
29 atoms
Cl 1.756087 -1.003454 -1.869761
Cl 3.72774 -0.591593 0.222856
S  -1.302056 1.369418 0.555638
S  1.023769 -0.270622 0.92032
F  2.316941 1.212501 -0.837578
O  -1.339526 1.483487 1.994448
O  -2.509989 1.319136 -0.229706
N  -0.465003 -0.075282 0.143666
N  -0.263127 2.484916 -0.023759
C  -1.289725 -1.234446 -0.028403
C  0.288491 3.502559 0.849574
C  -0.328781 2.774025 -1.443093
C  -1.732295 -1.5530 -1.302167
C  -1.657359 -2.014678 1.059222
C  -2.538428 -2.664068 -1.490257
C  -2.453505 -3.131388 0.864177
C  -2.896996 -3.456038 -0.409494
C  2.182852 -0.065295 -0.449966
H  -0.349026 4.387616 0.915303
H  1.258244 3.800093 0.452625
H  0.443498 3.108792 1.848604
H  -0.453153 1.859702 -2.019686
H  0.615089 3.223333 -1.745051
H  -1.141404 3.458483 -1.694462
H  -1.443967 -0.930576 -2.137376
H  -1.321913 -1.752301 2.05478
H  -2.886876 -2.911859 -2.483848
H  -2.737308 -3.741599 1.710963
H  -3.524996 -4.324229 -0.558661
totalener: -2426.22661574 hartree
nucrepener: 2142.24047866 hartree
electener: -4568.46709440 hartree
oneelecener: -7605.13547298 hartree
twoeener: 3036.66837858 hartree
kineticenergy: 2420.52450532 hartree
xcener: -145.811241789925 hartree
chargesum: -0.0000000
charge: -0.039162 -0.038919 0.830974 0.069482 -0.142204 -0.453581 -0.432454 -0.185745 -0.197683 0.161573 -0.170311 -0.193708 -0.201445 -0.191855 -0.066548 -0.082539 -0.140501 0.199377 0.114094 0.094864 0.122180 0.108338 0.101977 0.130390 0.104433 0.118716 0.125494 0.127444 0.127321
qa: -0.0392 -0.0389 0.8310 0.0695 -0.1422 -0.4536 -0.4325 -0.1857 -0.1977 0.1616 -0.1703 -0.1937 -0.2014 -0.1919 -0.0665 -0.0825 -0.1405 0.1994 0.1141 0.0949 0.1222 0.1083 0.1020 0.1304 0.1044 0.1187 0.1255 0.1274 0.1273
va: 1.2608 1.2584 6.0034 2.4007 1.1345 2.0336 2.0553 2.9253 2.9910 3.7300 3.9001 3.9272 4.1191 4.1490 3.9440 3.9511 3.9827 4.4961 0.9908 0.9940 1.0124 1.0047 0.9957 0.9996 1.0286 1.0225 1.0005 1.0008 1.0000
dispcorr: -0.017907957 hartree
energy: -2426.244523695211
dipole: -20.80737 21.36693 0.55956 6.98980 -6.93266 0.05714 0.12188 -0.76040 -0.63851
magnitude: 0.85093 au
magnitude: 2.16288 debye
