program: Orca
programVersion: 5.0.2
elementType: Cl Cl Cl S O O N C C C C C C C C C H H H H H H H H
charge: 0
multiplicity: 1
keywords: wb97x-d3
keywords: def2-TZVPP
keywords: def2/J RIJCOSX
keywords: DEFGRID2
keywords: scfconv7
keywords: smallprint printgap noloewdin
keywords: NOSOSCF
formula: C9H8Cl3NO2S
InChI: InChI=1/C9H8Cl3NO2S/c10-9(11,12)16-13-7(14)5-3-1-2-4-6(5)8(13)15/h1-2,5-6H,3-4H2
24 atoms
Cl -1.863885 -1.626911 -0.720298
Cl -3.767663 0.074223 0.631076
Cl -1.746298 1.20518 -1.106632
S  -1.141394 0.108464 1.591108
O  0.777404 -2.219344 1.207462
O  0.763883 2.306288 0.74141
N  0.430792 0.045397 0.994475
C  2.466128 -0.772289 0.196625
C  2.609472 0.726925 0.4809
C  2.344996 -1.096084 -1.300117
C  3.409932 1.563306 -0.524454
C  1.17215 -1.140702 0.869884
C  1.195674 1.190014 0.718823
C  3.405959 -0.387198 -2.080005
C  3.879016 0.800135 -1.720821
C  -2.098937 -0.064011 0.060993
H  3.287385 -1.347898 0.623493
H  3.081769 0.827388 1.465334
H  1.357585 -0.805805 -1.678915
H  2.416792 -2.175426 -1.439268
H  4.271332 2.007059 -0.023246
H  2.813084 2.4158 -0.86329
H  3.77767 -0.869596 -2.976525
H  4.639473 1.281235 -2.325697
elementType: Cl S O N C H
totalener: -2331.87128787 hartree
nucrepener: 1719.74833396 hartree
electener: -4051.61962182 hartree
oneelecener: -6632.29019192 hartree
twoeener: 2580.67057009 hartree
cpcmener: -0.02214542 hartree
kineticenergy: 2326.97281291 hartree
xcener: -134.725869320792 hartree
chargesum: -0.0000000
charge: -0.024573 -0.023147 -0.023173 0.089436 -0.369856 -0.377397 -0.112010 0.178611 -0.021800 -0.134675 -0.035890 0.152959 0.231617 -0.195434 -0.244299 0.059213 0.100079 0.116940 0.083749 0.102107 0.092662 0.082187 0.137937 0.134759
qa: -0.0246 -0.0231 -0.0232 0.0894 -0.3699 -0.3774 -0.1120 0.1786 -0.0218 -0.1347 -0.0359 0.1530 0.2316 -0.1954 -0.2443 0.0592 0.1001 0.1169 0.0837 0.1021 0.0927 0.0822 0.1379 0.1348
va: 1.2642 1.2598 1.2654 2.3162 2.1329 2.1346 3.1305 3.7300 3.8765 3.9568 3.9053 4.2803 4.2319 3.8204 3.9435 4.5240 1.0143 1.0166 1.0118 1.0149 1.0021 1.0212 1.0013 0.9993
dispcorr: -0.013436538 hartree
energy: -2331.884724405972
dipole: 34.26160 -32.47034 1.79125 1.66443 -1.61502 0.04942 -5.25777 4.74808 -0.50969
magnitude: 1.86301 au
magnitude: 4.73540 debye
