program: Orca
programVersion: 5.0.2
elementType: Cl Cl Cl S O O N C C C C C C C C C H H H H H H H H
charge: 0
multiplicity: 1
keywords: wb97x-d3
keywords: def2-TZVPP
keywords: def2/J RIJCOSX
keywords: DEFGRID2
keywords: scfconv7
keywords: smallprint printgap noloewdin
keywords: NOSOSCF
formula: C9H8Cl3NO2S
InChI: InChI=1/C9H8Cl3NO2S/c10-9(11,12)16-13-7(14)5-3-1-2-4-6(5)8(13)15/h1-2,5-6H,3-4H2
24 atoms
Cl -1.598729 -1.430692 -1.013813
Cl -3.684715 0.002273 0.385597
Cl -1.596359 1.428633 -1.017221
S  -1.148455 0.001696 1.557739
O  0.797005 -2.271069 1.126224
O  0.79826 2.272637 1.122962
N  0.472081 0.000851 1.096302
C  2.643568 -0.76799 0.607457
C  2.644048 0.767793 0.606523
C  3.030629 -1.387535 -0.746719
C  3.031757 1.38546 -0.748309
C  1.233613 -1.166871 0.966477
C  1.23427 1.167971 0.964823
C  2.339969 -0.666672 -1.864349
C  2.340547 0.663879 -1.865138
C  -1.972318 0.000422 -0.058219
H  3.300129 -1.162433 1.38628
H  3.300701 1.16275 1.385011
H  2.805256 -2.453586 -0.744926
H  4.116646 -1.304027 -0.855172
H  4.117713 1.300915 -0.856578
H  2.807277 2.4517 -0.747764
H  1.851048 -1.23455 -2.646551
H  1.852107 1.231256 -2.648003
elementType: Cl S O N C H
totalener: -2331.87308689 hartree
nucrepener: 1751.18129959 hartree
electener: -4083.05438649 hartree
oneelecener: -6695.68719599 hartree
twoeener: 2612.63280951 hartree
cpcmener: -0.02213885 hartree
kineticenergy: 2326.97442926 hartree
xcener: -134.725637805226 hartree
chargesum: -0.0000000
charge: -0.022512 -0.023506 -0.022504 0.093002 -0.379052 -0.379051 -0.093704 0.076249 0.076457 -0.098381 -0.098470 0.180790 0.180699 -0.216806 -0.216552 0.057791 0.100469 0.100487 0.099329 0.100959 0.100953 0.099331 0.141985 0.142037
qa: -0.0225 -0.0235 -0.0225 0.0930 -0.3791 -0.3791 -0.0937 0.0762 0.0765 -0.0984 -0.0985 0.1808 0.1807 -0.2168 -0.2166 0.0578 0.1005 0.1005 0.0993 0.1010 0.1010 0.0993 0.1420 0.1420
va: 1.2655 1.2593 1.2656 2.3125 2.1285 2.1285 3.1218 3.8261 3.8259 3.9523 3.9525 4.2224 4.2225 3.8112 3.8109 4.5262 1.0225 1.0225 1.0216 1.0040 1.0040 1.0216 0.9994 0.9994
dispcorr: -0.014448024 hartree
energy: -2331.887534915983
dipole: 32.24994 -30.21541 2.03453 -0.00835 0.00756 -0.00079 -3.30419 2.88732 -0.41688
magnitude: 2.07680 au
magnitude: 5.27881 debye
