program: Orca
programVersion: 5.0.2
elementType: Cl Cl Cl S O O N C C C C C C C C C H H H H H H H H
charge: 0
multiplicity: 1
keywords: wb97x-d3
keywords: def2-TZVPP
keywords: def2/J RIJCOSX
keywords: DEFGRID2
keywords: scfconv7
keywords: smallprint printgap noloewdin
keywords: NOSOSCF
formula: C9H8Cl3NO2S
InChI: InChI=1/C9H8Cl3NO2S/c10-9(11,12)16-13-7(14)5-3-1-2-4-6(5)8(13)15/h1-2,5-6H,3-4H2
24 atoms
Cl -1.854558 0.693072 2.024385
Cl -3.852392 0.127454 0.011343
Cl -1.816405 -1.82318 0.662996
S  -1.256624 0.645581 -0.889039
O  0.656007 -1.627145 -1.590172
O  0.749982 2.298737 0.72145
N  0.327526 0.333884 -0.414764
C  2.322499 -0.795638 0.000077
C  2.535634 0.700103 0.251787
C  3.492632 -1.577948 -0.583274
C  3.282967 1.396648 -0.897888
C  1.042005 -0.817783 -0.806289
C  1.129889 1.257277 0.283957
C  4.508434 -0.733114 -1.278949
C  4.429221 0.584317 -1.408943
C  -2.166997 -0.104628 0.48695
H  2.03589 -1.256426 0.953707
H  3.048816 0.894406 1.193423
H  3.112815 -2.340849 -1.268707
H  3.990268 -2.135158 0.215057
H  3.623231 2.374133 -0.553166
H  2.601086 1.605661 -1.730989
H  5.363274 -1.256646 -1.691025
H  5.211228 1.11714 -1.936591
totalener: -2331.84989864 hartree
nucrepener: 1701.80420775 hartree
electener: -4033.65410638 hartree
oneelecener: -6596.41680527 hartree
twoeener: 2562.76269888 hartree
kineticenergy: 2327.01013027 hartree
xcener: -134.726679365347 hartree
chargesum: -0.0000000
charge: -0.017724 -0.025323 -0.024782 0.109067 -0.275532 -0.276853 -0.131020 -0.020974 0.132473 -0.059008 -0.152760 0.135418 0.128470 -0.184774 -0.167949 0.059448 0.093716 0.091185 0.093060 0.082683 0.100768 0.085743 0.111007 0.113661
qa: -0.0177 -0.0253 -0.0248 0.1091 -0.2755 -0.2769 -0.1310 -0.0210 0.1325 -0.0590 -0.1528 0.1354 0.1285 -0.1848 -0.1679 0.0594 0.0937 0.0912 0.0931 0.0827 0.1008 0.0857 0.1110 0.1137
va: 1.2723 1.2588 1.2669 2.3160 2.2240 2.2271 3.1148 3.8403 3.7554 3.9245 3.9860 4.2910 4.2986 3.9393 3.8573 4.5288 1.0256 1.0143 1.0213 1.0022 1.0134 1.0014 1.0056 1.0080
dispcorr: -0.012833629 hartree
energy: -2331.862732265931
dipole: 37.39283 -36.08002 1.31280 0.42047 -0.68333 -0.26286 -8.07565 8.28351 0.20785
magnitude: 1.35490 au
magnitude: 3.44388 debye
