program: Orca
programVersion: 5.0.2
elementType: Cl Cl Cl Cl S O O N C C C C C C C C C C H H H H H H H H H
charge: 0
multiplicity: 1
keywords: wb97x-d3
keywords: def2-TZVPP
keywords: def2/J RIJCOSX
keywords: DEFGRID2
keywords: scfconv7
keywords: smallprint printgap noloewdin
keywords: NOSOSCF
formula: C10H9Cl4NO2S
InChI: InChI=1/C10H9Cl4NO2S/c11-9(12)10(13,14)18-15-7(16)5-3-1-2-4-6(5)8(15)17/h1-2,5-6,9H,3-4H2
27 atoms
Cl 1.139697 -1.300182 -1.409629
Cl 2.004066 1.424439 -1.536731
Cl 3.488957 1.046277 1.303018
Cl 2.856646 -1.771297 1.207007
S  0.474479 0.514475 0.859103
O  -1.25861 -1.947849 0.95723
O  -1.268641 2.164561 -0.971769
N  -0.972415 0.151714 0.081214
C  -2.923911 -0.998357 -0.550807
C  -2.931509 0.395682 -1.196093
C  -4.136299 -1.2643 0.35612
C  -4.144718 1.252809 -0.800287
C  -1.652692 -1.055029 0.257307
C  -1.661147 1.056308 -0.727678
C  -4.39777 -0.072836 1.227256
C  -4.400402 1.136677 0.672055
C  1.686367 0.061822 -0.438386
C  3.010794 -0.299584 0.250119
H  -2.857379 -1.781835 -1.309203
H  -2.875217 0.325502 -2.284634
H  -3.974622 -2.170762 0.93771
H  -4.99849 -1.460521 -0.288104
H  -5.008601 0.889058 -1.364501
H  -3.987823 2.285152 -1.109941
H  -4.573327 -0.212289 2.286782
H  -4.578249 2.030312 1.257361
H  3.79002 -0.450348 -0.49598
elementType: Cl S O N C H
totalener: -2830.79181593 hartree
nucrepener: 2190.97790582 hartree
electener: -5021.76972175 hartree
oneelecener: -8261.72473060 hartree
twoeener: 3239.95500885 hartree
cpcmener: -0.03169805 hartree
kineticenergy: 2825.08536373 hartree
xcener: -159.723783411856 hartree
chargesum: -0.0000000
charge: -0.041987 -0.051711 -0.069343 -0.061547 0.052815 -0.409722 -0.413939 -0.084603 0.083499 0.068124 -0.097270 -0.101175 0.187018 0.224126 -0.219112 -0.217880 0.073149 -0.013474 0.105246 0.105011 0.096713 0.103481 0.104324 0.096711 0.146296 0.146413 0.188838
qa: -0.0420 -0.0517 -0.0693 -0.0615 0.0528 -0.4097 -0.4139 -0.0846 0.0835 0.0681 -0.0973 -0.1012 0.1870 0.2241 -0.2191 -0.2179 0.0731 -0.0135 0.1052 0.1050 0.0967 0.1035 0.1043 0.0967 0.1463 0.1464 0.1888
va: 1.2696 1.2517 1.2310 1.2306 2.3082 2.0953 2.0946 3.1018 3.8367 3.8663 3.9546 3.9533 4.2028 4.1895 3.8247 3.8234 4.3345 4.2402 1.0240 1.0238 1.0221 1.0042 1.0037 1.0220 0.9958 0.9958 0.9954
dispcorr: -0.015629091 hartree
energy: -2830.807445022491
dipole: -40.14331 38.73015 -1.41316 0.25881 -0.83866 -0.57986 -1.65565 0.36676 -1.28889
magnitude: 1.99862 au
magnitude: 5.08010 debye
