program: Orca
programVersion: 5.0.2
elementType: Cl Cl Cl Cl S O O N C C C C C C C C C C H H H H H H H H H
charge: 0
multiplicity: 1
keywords: wb97x-d3
keywords: def2-TZVPP
keywords: def2/J RIJCOSX
keywords: DEFGRID2
keywords: scfconv7
keywords: smallprint printgap noloewdin
keywords: NOSOSCF
formula: C10H9Cl4NO2S
InChI: InChI=1/C10H9Cl4NO2S/c11-9(12)10(13,14)18-15-7(16)5-3-1-2-4-6(5)8(15)17/h1-2,5-6,9H,3-4H2
27 atoms
Cl 0.565767 0.786453 1.370051
Cl 1.579533 -1.829472 0.741015
Cl 3.787368 0.353491 1.531224
Cl 3.717278 -0.358541 -1.281545
S  0.694723 -0.055143 -1.485131
O  -1.35733 -2.185891 -0.880934
O  -1.114641 2.343754 -1.207786
N  -0.934893 0.058438 -1.086939
C  -3.137721 -0.555029 -0.557625
C  -3.066642 0.9700 -0.71825
C  -3.601301 -1.015261 0.834987
C  -3.552578 1.765299 0.507175
C  -1.750278 -1.054168 -0.855645
C  -1.625916 1.274135 -1.031373
C  -4.787188 -0.20408 1.261608
C  -4.766453 1.11516 1.098866
C  1.467746 -0.155086 0.184227
C  2.863319 0.46301 0.03742
H  -3.811669 -0.984909 -1.301883
H  -3.656798 1.279168 -1.584574
H  -2.786526 -0.884366 1.556472
H  -3.828674 -2.079947 0.812466
H  -3.748719 2.796991 0.219963
H  -2.759708 1.798247 1.262756
H  -5.640339 -0.705891 1.701743
H  -5.601809 1.734608 1.401987
H  2.766267 1.514254 -0.231976
elementType: Cl S O N C H
totalener: -2830.80185522 hartree
nucrepener: 2175.96419450 hartree
electener: -5006.76604972 hartree
oneelecener: -8230.91958861 hartree
twoeener: 3224.15353889 hartree
cpcmener: -0.02545994 hartree
kineticenergy: 2825.07553444 hartree
xcener: -159.719608053884 hartree
chargesum: -0.0000000
charge: -0.045698 -0.045807 -0.061416 -0.067076 0.053281 -0.384271 -0.384530 -0.080268 0.085120 0.072462 -0.117526 -0.089478 0.196191 0.158908 -0.204053 -0.223589 0.082685 -0.023324 0.108328 0.109303 0.098486 0.098174 0.098565 0.097975 0.141638 0.142534 0.183387
qa: -0.0457 -0.0458 -0.0614 -0.0671 0.0533 -0.3843 -0.3845 -0.0803 0.0851 0.0725 -0.1175 -0.0895 0.1962 0.1589 -0.2041 -0.2236 0.0827 -0.0233 0.1083 0.1093 0.0985 0.0982 0.0986 0.0980 0.1416 0.1425 0.1834
va: 1.2707 1.2641 1.2289 1.2311 2.3086 2.1267 2.1210 3.0964 3.7921 3.7968 3.9521 3.9337 4.2490 4.2687 3.8434 3.8774 4.3131 4.2487 1.0186 1.0189 1.0085 1.0229 1.0201 1.0064 0.9984 0.9981 1.0035
dispcorr: -0.015656224 hartree
energy: -2830.817511441046
dipole: -40.45018 38.59922 -1.85096 5.60114 -4.86889 0.73225 0.43325 -0.22478 0.20847
magnitude: 2.00142 au
magnitude: 5.08722 debye
