program: Orca
programVersion: 5.0.2
elementType: Cl Cl Cl Cl S O O N C C C C C C C C C C H H H H H H H H H
charge: 0
multiplicity: 1
keywords: wb97x-d3
keywords: def2-TZVPP
keywords: def2/J RIJCOSX
keywords: DEFGRID2
keywords: scfconv7
keywords: smallprint printgap noloewdin
keywords: NOSOSCF
formula: C10H9Cl4NO2S
InChI: InChI=1/C10H9Cl4NO2S/c11-9(12)10(13,14)18-15-7(16)5-3-1-2-4-6(5)8(15)17/h1-2,5-6,9H,3-4H2
27 atoms
Cl 2.758834 -1.716447 0.621891
Cl 1.024748 -1.029686 -1.59306
Cl 2.856096 1.387125 1.439965
Cl 3.633408 0.787121 -1.278795
S  0.245201 -0.474041 1.225387
O  -1.932574 -2.362647 0.36181
O  -0.805745 2.009612 -0.192114
N  -1.108236 -0.21847 0.257084
C  -3.154819 -0.632171 -0.836713
C  -2.757655 0.835917 -1.050016
C  -4.493095 -0.814551 -0.101587
C  -3.795622 1.847701 -0.544611
C  -2.031869 -1.237186 -0.018588
C  -1.457063 1.009798 -0.294549
C  -4.61695 0.16934 1.022681
C  -4.291213 1.440477 0.8102
C  1.611549 -0.534792 -0.008215
C  2.28849 0.839723 -0.137595
H  -3.19064 -1.176378 -1.783476
H  -2.541831 1.036337 -2.102936
H  -4.57979 -1.844378 0.243629
H  -5.305139 -0.662249 -0.82033
H  -4.626349 1.879261 -1.257451
H  -3.357798 2.845327 -0.538166
H  -4.974301 -0.166787 1.987591
H  -4.37106 2.182478 1.594181
H  1.556523 1.560062 -0.4958
totalener: -2830.77991384 hartree
nucrepener: 2178.73853569 hartree
electener: -5009.51844953 hartree
oneelecener: -8236.52656961 hartree
twoeener: 3227.00812008 hartree
kineticenergy: 2825.12342182 hartree
xcener: -159.724039792956 hartree
chargesum: -0.0000000
charge: -0.028430 -0.054337 -0.057933 -0.063489 0.088077 -0.286039 -0.339887 -0.112451 0.022404 0.086787 -0.112148 -0.133331 0.158140 0.139851 -0.192742 -0.168092 0.102846 -0.052519 0.088965 0.089561 0.108115 0.093340 0.094721 0.105057 0.126753 0.127577 0.169204
qa: -0.0284 -0.0543 -0.0579 -0.0635 0.0881 -0.2860 -0.3399 -0.1125 0.0224 0.0868 -0.1121 -0.1333 0.1581 0.1399 -0.1927 -0.1681 0.1028 -0.0525 0.0890 0.0896 0.1081 0.0933 0.0947 0.1051 0.1268 0.1276 0.1692
va: 1.2853 1.2674 1.2317 1.2270 2.2931 2.2197 2.1629 3.1224 3.8540 3.7830 3.9577 3.9698 4.2196 4.2430 3.8612 3.8296 4.3073 4.3128 1.0265 1.0269 1.0211 1.0040 1.0035 1.0227 1.0041 1.0038 1.0150
dispcorr: -0.015748341 hartree
energy: -2830.795662180263
dipole: -43.36678 41.61096 -1.75582 6.10868 -5.67880 0.42988 -1.91891 1.20631 -0.71260
magnitude: 1.94307 au
magnitude: 4.93888 debye
