program: Orca
programVersion: 5.0.2
elementType: Cl Cl Cl Cl S O O N C C C C C C C C C C H H H H H H H H H
charge: 0
multiplicity: 1
keywords: wb97x-d3
keywords: def2-TZVPP
keywords: def2/J RIJCOSX
keywords: DEFGRID2
keywords: scfconv7
keywords: smallprint printgap noloewdin
keywords: NOSOSCF
formula: C10H9Cl4NO2S
InChI: InChI=1/C10H9Cl4NO2S/c11-9(12)10(13,14)18-15-7(16)5-3-1-2-4-6(5)8(15)17/h1-2,5-6,9H,3-4H2
27 atoms
Cl -1.802042 -2.239127 0.262586
Cl -1.197924 0.022341 1.910645
Cl -3.063102 1.869091 0.134207
Cl -3.456103 -0.313465 -1.718736
S  -0.475984 0.125617 -0.980928
O  1.459165 -2.16373 -0.606646
O  1.07813 2.218007 0.529284
N  0.973563 0.024613 -0.131835
C  3.0086 -0.809464 0.702057
C  2.871817 0.668289 1.098727
C  4.257524 -1.109278 -0.142853
C  4.017048 1.555798 0.586275
C  1.763301 -1.125429 -0.08581
C  1.56312 1.119821 0.502896
C  4.440769 -0.054543 -1.192219
C  4.326728 1.224414 -0.842167
C  -1.661573 -0.466452 0.284434
C  -3.044488 0.116074 -0.047685
H  3.003483 -1.454948 1.583152
H  2.783641 0.776476 2.182266
H  4.185842 -2.1075 -0.572633
H  5.119433 -1.125769 0.530869
H  4.891872 1.370556 1.216706
H  3.761431 2.606358 0.717963
H  4.660375 -0.346458 -2.211721
H  4.4480 2.023558 -1.56292
H  -3.798578 -0.307321 0.615026
elementType: Cl S O N C H
totalener: -2830.79210362 hartree
nucrepener: 2189.02001538 hartree
electener: -5019.81211900 hartree
oneelecener: -8257.80752851 hartree
twoeener: 3237.99540952 hartree
cpcmener: -0.03179557 hartree
kineticenergy: 2825.07860003 hartree
xcener: -159.722499793843 hartree
chargesum: -0.0000000
charge: -0.051421 -0.041995 -0.061741 -0.069032 0.052736 -0.413461 -0.410952 -0.084050 0.065243 0.082971 -0.098114 -0.097612 0.222874 0.193208 -0.219723 -0.216959 0.072056 -0.014595 0.105294 0.104792 0.096275 0.103943 0.102726 0.095832 0.145911 0.146460 0.189331
qa: -0.0514 -0.0420 -0.0617 -0.0690 0.0527 -0.4135 -0.4110 -0.0841 0.0652 0.0830 -0.0981 -0.0976 0.2229 0.1932 -0.2197 -0.2170 0.0721 -0.0146 0.1053 0.1048 0.0963 0.1039 0.1027 0.0958 0.1459 0.1465 0.1893
va: 1.2521 1.2688 1.2302 1.2309 2.3063 2.0941 2.0942 3.1046 3.8689 3.8383 3.9511 3.9567 4.1918 4.1993 3.8257 3.8236 4.3373 4.2386 1.0237 1.0244 1.0219 1.0035 1.0043 1.0224 0.9959 0.9957 0.9951
dispcorr: -0.015587246 hartree
energy: -2830.807690863546
dipole: 40.18499 -38.75425 1.43075 2.26017 -2.52023 -0.26006 1.58739 -0.21452 1.37287
magnitude: 1.99986 au
magnitude: 5.08324 debye
