program: Orca
programVersion: 5.0.2
elementType: Cl Cl Cl Cl S O O N C C C C C C C C C C H H H H H H H H H
charge: 0
multiplicity: 1
keywords: wb97x-d3
keywords: def2-TZVPP
keywords: def2/J RIJCOSX
keywords: DEFGRID2
keywords: scfconv7
keywords: smallprint printgap noloewdin
keywords: NOSOSCF
formula: C10H9Cl4NO2S
InChI: InChI=1/C10H9Cl4NO2S/c11-9(12)10(13,14)18-15-7(16)5-3-1-2-4-6(5)8(15)17/h1-2,5-6,9H,3-4H2
27 atoms
Cl -1.898958 -1.94075 -0.108867
Cl -1.054009 0.033954 1.803552
Cl -3.231463 0.506926 -1.840696
Cl -4.171603 0.094118 0.874805
S  -0.294581 0.37908 -1.056692
O  1.509321 -2.02932 -0.750794
O  1.287919 2.28982 0.638827
N  1.119542 0.153569 -0.174432
C  3.085046 -0.82395 0.668541
C  3.000079 0.630771 1.15497
C  4.343143 -1.12388 -0.162855
C  4.198519 1.495447 0.73349
C  1.849027 -1.036036 -0.167519
C  1.731763 1.177435 0.5523
C  4.601668 -0.013292 -1.135951
C  4.534313 1.243952 -0.705091
C  -1.562596 -0.222175 0.13837
C  -2.818098 0.618506 -0.12028
H  3.029101 -1.522664 1.506186
H  2.882946 0.674917 2.24025
H  4.240616 -2.088267 -0.658575
H  5.184483 -1.221904 0.529739
H  5.04533 1.229225 1.373187
H  3.985934 2.545891 0.927697
H  4.838012 -0.248668 -2.166287
H  4.712396 2.081834 -1.367639
H  -2.606386 1.66288 0.104869
elementType: Cl S O N C H
totalener: -2830.79338146 hartree
nucrepener: 2173.23119340 hartree
electener: -5004.02457486 hartree
oneelecener: -8225.87021596 hartree
twoeener: 3221.84564110 hartree
cpcmener: -0.03013883 hartree
kineticenergy: 2825.08297390 hartree
xcener: -159.723841219142 hartree
chargesum: -0.0000000
charge: -0.048283 -0.041642 -0.068276 -0.062295 0.054601 -0.413216 -0.411035 -0.091289 0.060803 0.089627 -0.095146 -0.098893 0.225798 0.190208 -0.221446 -0.216185 0.077718 -0.019161 0.105735 0.105725 0.096606 0.103863 0.103125 0.095995 0.145974 0.146407 0.184683
qa: -0.0483 -0.0416 -0.0683 -0.0623 0.0546 -0.4132 -0.4110 -0.0913 0.0608 0.0896 -0.0951 -0.0989 0.2258 0.1902 -0.2214 -0.2162 0.0777 -0.0192 0.1057 0.1057 0.0966 0.1039 0.1031 0.0960 0.1460 0.1464 0.1847
va: 1.2605 1.2726 1.2305 1.2280 2.3029 2.0949 2.0916 3.1080 3.8743 3.8378 3.9501 3.9582 4.1855 4.1964 3.8279 3.8221 4.3133 4.2493 1.0237 1.0240 1.0215 1.0035 1.0041 1.0220 0.9959 0.9957 1.0031
dispcorr: -0.015311429 hartree
energy: -2830.808692884907
dipole: 43.41020 -41.44349 1.96671 4.67856 -4.26786 0.41070 1.37015 -0.20838 1.16176
magnitude: 2.32084 au
magnitude: 5.89911 debye
