program: Orca
programVersion: 5.0.2
elementType: Cl Cl Cl Cl S O O N C C C C C C C C C C H H H H H H H H H
charge: 0
multiplicity: 1
keywords: wb97x-d3
keywords: def2-TZVPP
keywords: def2/J RIJCOSX
keywords: DEFGRID2
keywords: scfconv7
keywords: smallprint printgap noloewdin
keywords: NOSOSCF
formula: C10H9Cl4NO2S
InChI: InChI=1/C10H9Cl4NO2S/c11-9(12)10(13,14)18-15-7(16)5-3-1-2-4-6(5)8(15)17/h1-2,5-6,9H,3-4H2
27 atoms
Cl -0.491223 1.173292 -1.210231
Cl -1.230499 -1.59632 -1.025106
Cl -3.617904 0.437924 -1.655368
Cl -3.641042 -0.664547 1.026651
S  -0.674379 -0.080878 1.478126
O  1.376947 -2.230314 0.961428
O  1.205071 2.28674 1.427198
N  0.981542 0.016735 1.182309
C  3.221362 -0.639098 0.87974
C  3.160377 0.888402 1.023429
C  3.827409 -1.116939 -0.449459
C  3.701788 1.648673 -0.198201
C  1.793353 -1.105396 1.000137
C  1.703263 1.211774 1.233987
C  3.286552 -0.309616 -1.589638
C  3.224353 1.013697 -1.468464
C  -1.340622 -0.021179 -0.229939
C  -2.803501 0.421332 -0.095861
H  3.772049 -1.088033 1.709502
H  3.692158 1.219675 1.918038
H  3.643214 -2.182713 -0.579406
H  4.912995 -0.998307 -0.382762
H  4.794353 1.617552 -0.150008
H  3.422028 2.699606 -0.135795
H  2.954883 -0.812527 -2.489273
H  2.839362 1.638465 -2.264452
H  -2.839075 1.426817 0.320931
elementType: Cl S O N C H
totalener: -2830.79342086 hartree
nucrepener: 2212.89669154 hartree
electener: -5043.69011239 hartree
oneelecener: -8305.45942322 hartree
twoeener: 3261.76931082 hartree
cpcmener: -0.03099486 hartree
kineticenergy: 2825.08669305 hartree
xcener: -159.725737022038 hartree
chargesum: -0.0000000
charge: -0.044009 -0.048563 -0.062736 -0.067939 0.051381 -0.411757 -0.410559 -0.071462 0.061307 0.095761 -0.095010 -0.090260 0.221160 0.180033 -0.217091 -0.227824 0.078013 -0.021125 0.103226 0.102204 0.096526 0.101949 0.102947 0.098072 0.144515 0.144824 0.186417
qa: -0.0440 -0.0486 -0.0627 -0.0679 0.0514 -0.4118 -0.4106 -0.0715 0.0613 0.0958 -0.0950 -0.0903 0.2212 0.1800 -0.2171 -0.2278 0.0780 -0.0211 0.1032 0.1022 0.0965 0.1019 0.1029 0.0981 0.1445 0.1448 0.1864
va: 1.2685 1.2639 1.2269 1.2307 2.3051 2.0943 2.0882 3.1135 3.8646 3.8262 3.9558 3.9446 4.1883 4.2178 3.8171 3.8077 4.3380 4.2322 1.0230 1.0211 1.0216 1.0045 1.0029 1.0224 0.9972 0.9971 1.0023
dispcorr: -0.016485075 hartree
energy: -2830.809905930232
dipole: 37.80473 -35.72792 2.07681 4.15179 -3.45875 0.69305 1.91845 -1.78381 0.13464
magnitude: 2.19353 au
magnitude: 5.57551 debye
