program: Orca
programVersion: 5.0.2
elementType: Cl Cl Cl Cl S O O N C C C C C C C C C C H H H H H H H H H
charge: 0
multiplicity: 1
keywords: wb97x-d3
keywords: def2-TZVPP
keywords: def2/J RIJCOSX
keywords: DEFGRID2
keywords: scfconv7
keywords: smallprint printgap noloewdin
keywords: NOSOSCF
formula: C10H9Cl4NO2S
InChI: InChI=1/C10H9Cl4NO2S/c11-9(12)10(13,14)18-15-7(16)5-3-1-2-4-6(5)8(15)17/h1-2,5-6,9H,3-4H2
27 atoms
Cl -0.925807 -1.271812 1.284416
Cl -1.956718 1.408739 1.128923
Cl -4.112322 -0.928665 0.756099
Cl -3.436447 0.531397 -1.661533
S  -0.436666 0.318654 -1.187281
O  1.33608 -2.133544 -1.169849
O  1.386953 2.118308 0.449843
N  1.048048 0.033552 -0.455973
C  3.122723 -0.930767 -0.011926
C  2.900358 0.252399 0.936927
C  4.085459 -0.601129 -1.163986
C  4.119782 1.095467 1.299551
C  1.760191 -1.163862 -0.60376
C  1.740538 0.980343 0.313143
C  5.299703 0.121554 -0.674951
C  5.303267 0.8797 0.414824
C  -1.590385 -0.053469 0.202695
C  -2.860412 -0.617914 -0.440773
H  3.468901 -1.819381 0.514351
H  2.469622 -0.150096 1.862049
H  3.585908 0.014453 -1.921171
H  4.36524 -1.525819 -1.669241
H  4.409727 0.881296 2.33008
H  3.855605 2.15684 1.299234
H  6.202604 0.024789 -1.266237
H  6.21423 1.387814 0.710195
H  -2.625219 -1.553528 -0.945647
elementType: Cl S O N C H
totalener: -2830.79165459 hartree
nucrepener: 2159.02599156 hartree
electener: -4989.81764615 hartree
oneelecener: -8197.00791117 hartree
twoeener: 3207.19026502 hartree
cpcmener: -0.03041155 hartree
kineticenergy: 2825.07885575 hartree
xcener: -159.724823769069 hartree
chargesum: -0.0000000
charge: -0.042731 -0.049192 -0.063133 -0.068320 0.048509 -0.404723 -0.404866 -0.108071 0.167018 -0.017394 -0.126297 -0.039091 0.192027 0.250926 -0.213085 -0.239756 0.076353 -0.016344 0.101957 0.121299 0.097789 0.102615 0.095171 0.079235 0.138447 0.136131 0.185525
qa: -0.0427 -0.0492 -0.0631 -0.0683 0.0485 -0.4047 -0.4049 -0.1081 0.1670 -0.0174 -0.1263 -0.0391 0.1920 0.2509 -0.2131 -0.2398 0.0764 -0.0163 0.1020 0.1213 0.0978 0.1026 0.0952 0.0792 0.1384 0.1361 0.1855
va: 1.2720 1.2608 1.2275 1.2303 2.3132 2.0984 2.1051 3.1209 3.7744 3.8811 3.9521 3.9145 4.2343 4.2071 3.8367 3.9227 4.3179 4.2429 1.0127 1.0223 1.0006 1.0129 1.0019 1.0228 1.0006 0.9982 1.0031
dispcorr: -0.015054169 hartree
energy: -2830.806708757527
dipole: 44.08889 -42.24852 1.84037 -0.20890 -0.61230 -0.82120 -1.16036 1.64101 0.48065
magnitude: 2.07180 au
magnitude: 5.26610 debye
