program: Orca
programVersion: 5.0.2
elementType: Cl Cl Cl Cl S O O N C C C C C C C C C C H H H H H H H H H
charge: 0
multiplicity: 1
keywords: wb97x-d3
keywords: def2-TZVPP
keywords: def2/J RIJCOSX
keywords: DEFGRID2
keywords: scfconv7
keywords: smallprint printgap noloewdin
keywords: NOSOSCF
formula: C10H9Cl4NO2S
InChI: InChI=1/C10H9Cl4NO2S/c11-9(12)10(13,14)18-15-7(16)5-3-1-2-4-6(5)8(15)17/h1-2,5-6,9H,3-4H2
27 atoms
Cl -1.20307 0.720396 1.806097
Cl -3.125669 1.383877 -0.268835
Cl -3.355781 -1.533947 1.139973
Cl -2.543031 -1.482093 -1.627869
S  -0.461634 0.969356 -1.048743
O  0.962627 -1.719095 -1.301925
O  1.623822 2.325049 0.67312
N  0.96654 0.38362 -0.374107
C  2.937219 -0.846105 -0.152971
C  2.89634 0.24595 0.922197
C  3.862704 -0.502561 -1.334057
C  4.21925 0.900616 1.299034
C  1.528933 -0.863077 -0.679146
C  1.811584 1.166081 0.431198
C  5.142434 0.127366 -0.889179
C  5.289834 0.759996 0.268432
C  -1.716452 0.399877 0.148607
C  -2.055963 -1.092323 0.021367
H  3.206174 -1.817315 0.259694
H  2.459172 -0.19936 1.824164
H  3.365553 0.176123 -2.037038
H  4.062358 -1.413766 -1.898662
H  4.576963 0.4690 2.236391
H  4.061439 1.959263 1.52212
H  5.974823 0.075113 -1.581464
H  6.247683 1.203957 0.515105
H  -1.183834 -1.692668 0.271979
elementType: Cl S O N C H
totalener: -2830.79402585 hartree
nucrepener: 2166.14383249 hartree
electener: -4996.93785834 hartree
oneelecener: -8210.98818580 hartree
twoeener: 3214.05032745 hartree
cpcmener: -0.03118242 hartree
kineticenergy: 2825.06257788 hartree
xcener: -159.722387641487 hartree
chargesum: -0.0000000
charge: -0.046187 -0.041010 -0.076728 -0.069420 0.068602 -0.408960 -0.400891 -0.109200 0.157888 0.011756 -0.118883 -0.045921 0.204666 0.216523 -0.222669 -0.229659 0.106508 -0.048224 0.102589 0.117597 0.096699 0.102704 0.096277 0.079420 0.137664 0.136618 0.182242
qa: -0.0462 -0.0410 -0.0767 -0.0694 0.0686 -0.4090 -0.4009 -0.1092 0.1579 0.0118 -0.1189 -0.0459 0.2047 0.2165 -0.2227 -0.2297 0.1065 -0.0482 0.1026 0.1176 0.0967 0.1027 0.0963 0.0794 0.1377 0.1366 0.1822
va: 1.2708 1.2748 1.2118 1.2198 2.2986 2.1009 2.1034 3.1382 3.8049 3.8525 3.9580 3.9135 4.2258 4.2229 3.8487 3.9073 4.3409 4.2745 1.0115 1.0231 1.0002 1.0123 1.0023 1.0230 1.0005 0.9976 1.0013
dispcorr: -0.015590316 hartree
energy: -2830.809616170349
dipole: 44.54813 -42.22406 2.32408 -0.09854 -0.76449 -0.86303 -0.25616 1.05392 0.79776
magnitude: 2.60434 au
magnitude: 6.61970 debye
