program: Orca
programVersion: 5.0.2
elementType: Cl Cl Cl Cl S O O N C C C C C C C C C C H H H H H H H H H
charge: 0
multiplicity: 1
keywords: wb97x-d3
keywords: def2-TZVPP
keywords: def2/J RIJCOSX
keywords: DEFGRID2
keywords: scfconv7
keywords: smallprint printgap noloewdin
keywords: NOSOSCF
formula: C10H9Cl4NO2S
InChI: InChI=1/C10H9Cl4NO2S/c11-9(12)10(13,14)18-15-7(16)5-3-1-2-4-6(5)8(15)17/h1-2,5-6,9H,3-4H2
27 atoms
Cl -0.512395 0.749093 -1.369143
Cl -1.573372 -1.845097 -0.720365
Cl -3.731588 0.366217 -1.57734
Cl -3.723271 -0.323705 1.242094
S  -0.693473 -0.057801 1.495094
O  1.363362 -2.188681 0.907104
O  1.124725 2.338953 1.257032
N  0.940656 0.055125 1.115289
C  3.139795 -0.556653 0.568204
C  3.069493 0.968043 0.731315
C  3.585753 -1.018243 -0.829949
C  3.534352 1.767194 -0.500236
C  1.755574 -1.056685 0.878708
C  1.632529 1.270396 1.063805
C  4.757481 -0.200431 -1.281758
C  4.735499 1.118829 -1.118758
C  -1.444638 -0.165187 -0.185212
C  -2.833375 0.474157 -0.067554
H  3.822343 -0.986277 1.304625
H  3.672608 1.277222 1.588505
H  2.758558 -0.898829 -1.539165
H  3.822432 -2.08085 -0.806061
H  3.737791 2.7971 -0.212012
H  2.72805 1.806469 -1.240972
H  5.60193 -0.697993 -1.743436
H  5.561058 1.740833 -1.443542
H  -2.72596 1.526116 0.194735
elementType: Cl S O N C H
totalener: -2830.80166295 hartree
nucrepener: 2178.10529879 hartree
electener: -5008.90696173 hartree
oneelecener: -8235.18210137 hartree
twoeener: 3226.27513964 hartree
cpcmener: -0.02537962 hartree
kineticenergy: 2825.07268668 hartree
xcener: -159.719138213456 hartree
chargesum: 0.0000000
charge: -0.046038 -0.045359 -0.061751 -0.067025 0.053632 -0.383707 -0.384574 -0.080425 0.086134 0.072689 -0.115992 -0.090546 0.193128 0.157084 -0.204616 -0.222249 0.083630 -0.022317 0.108378 0.109361 0.097972 0.098254 0.098856 0.098181 0.141616 0.142638 0.183047
qa: -0.0460 -0.0454 -0.0618 -0.0670 0.0536 -0.3837 -0.3846 -0.0804 0.0861 0.0727 -0.1160 -0.0905 0.1931 0.1571 -0.2046 -0.2222 0.0836 -0.0223 0.1084 0.1094 0.0980 0.0983 0.0989 0.0982 0.1416 0.1426 0.1830
va: 1.2716 1.2646 1.2287 1.2310 2.3078 2.1270 2.1211 3.0924 3.7901 3.7958 3.9519 3.9355 4.2517 4.2708 3.8452 3.8752 4.3097 4.2500 1.0184 1.0190 1.0090 1.0229 1.0203 1.0059 0.9985 0.9981 1.0037
dispcorr: -0.015744430 hartree
energy: -2830.817407376354
dipole: 40.18588 -38.33698 1.84890 5.62709 -4.89444 0.73265 -0.40152 0.15529 -0.24623
magnitude: 2.00396 au
magnitude: 5.09365 debye
