program: Orca
programVersion: 5.0.2
elementType: Cl Cl Cl Cl S O O N C C C C C C C C C C H H H H H H H H H
charge: 0
multiplicity: 1
keywords: wb97x-d3
keywords: def2-TZVPP
keywords: def2/J RIJCOSX
keywords: DEFGRID2
keywords: scfconv7
keywords: smallprint printgap noloewdin
keywords: NOSOSCF
formula: C10H9Cl4NO2S
InChI: InChI=1/C10H9Cl4NO2S/c11-9(12)10(13,14)18-15-7(16)5-3-1-2-4-6(5)8(15)17/h1-2,5-6,9H,3-4H2
27 atoms
Cl -1.168342 -0.345606 1.958351
Cl -3.21528 1.193015 0.588095
Cl -3.262978 -2.048426 0.281967
Cl -2.619951 -0.510488 -2.076482
S  -0.575365 1.382093 -0.374904
O  0.93923 -0.784449 -1.86939
O  1.481458 1.908043 1.754559
N  0.90749 0.640024 -0.072732
C  2.850503 -0.646968 -0.367998
C  3.046699 0.284974 0.835051
C  3.930811 -0.521724 -1.456304
C  4.258116 1.223633 0.705897
C  1.484244 -0.32295 -0.904931
C  1.761721 1.058666 0.957561
C  5.281997 -0.382788 -0.822566
C  5.439442 0.450712 0.2010
C  -1.754426 0.216393 0.394299
C  -2.052084 -1.010013 -0.484292
H  2.822534 -1.686371 -0.031306
H  3.164145 -0.299108 1.750791
H  3.729251 0.359611 -2.075468
H  3.884985 -1.383895 -2.119684
H  4.464545 1.69251 1.66676
H  4.024805 2.03347 0.005437
H  6.113117 -0.952979 -1.219529
H  6.404269 0.588351 0.673801
H  -1.145479 -1.597116 -0.614278
elementType: Cl S O N C H
totalener: -2830.80370487 hartree
nucrepener: 2158.52681686 hartree
electener: -4989.33052173 hartree
oneelecener: -8195.76641335 hartree
twoeener: 3206.43589162 hartree
cpcmener: -0.02594011 hartree
kineticenergy: 2825.07205544 hartree
xcener: -159.719128845899 hartree
chargesum: 0.0000000
charge: -0.046171 -0.039434 -0.075191 -0.067034 0.075336 -0.397677 -0.382844 -0.102318 0.071046 0.083327 -0.093088 -0.112359 0.196662 0.190427 -0.224688 -0.206082 0.103953 -0.052766 0.109128 0.107667 0.099308 0.098198 0.097509 0.101646 0.141628 0.142545 0.181271
qa: -0.0462 -0.0394 -0.0752 -0.0670 0.0753 -0.3977 -0.3828 -0.1023 0.0710 0.0833 -0.0931 -0.1124 0.1967 0.1904 -0.2247 -0.2061 0.1040 -0.0528 0.1091 0.1077 0.0993 0.0982 0.0975 0.1016 0.1416 0.1425 0.1813
va: 1.2710 1.2765 1.2139 1.2222 2.2923 2.1174 2.1295 3.1334 3.8428 3.7874 3.9309 3.9441 4.2367 4.2386 3.8790 3.8507 4.3448 4.2848 1.0188 1.0207 1.0068 1.0189 1.0215 1.0046 0.9982 0.9979 1.0020
dispcorr: -0.015479987 hartree
energy: -2830.819184861041
dipole: 45.28390 -42.88471 2.39920 0.98946 -1.83098 -0.84152 -2.82922 2.93159 0.10238
magnitude: 2.54456 au
magnitude: 6.46775 debye
